{"text_format":"1","workbook":"xlsx","n_sheets":10,"sheets":["Recipe Sheet","Mix Worksheet","CurrentWorksheet","Conversion Worksheet","Lists","RawMaterialTable","About","Constants","FAQ","scratchSheet1"],"not_rendered":{"charts":1,"images":0,"macros":1,"external_links":0,"defined_names":33,"comments":0,"pivot_tables":0},"unopened":[],"bounds":{"document_bytes":16777216,"sheet_cells":100000,"rows_first":2000,"rows_last":500,"rows_between":2000,"halvings":0,"cell_chars":16384,"cell_head_chars":4096},"cells_cut":0,"cells_raw":0,"read":"whole","date_system":"1900"}

{"sheet":"Recipe Sheet","index":0,"n_rows":36,"n_cols":29,"rows_kept":36,"cut":false,"hidden":false,"merged":[[32,2,32,3],[35,2,35,3],[27,2,27,3],[28,2,28,3],[30,2,30,3],[31,2,31,3],[22,2,22,3],[23,2,23,3],[24,2,24,3],[17,2,17,3],[18,2,18,3],[19,2,19,3],[20,2,20,3],[14,2,14,3],[15,2,15,3],[16,2,16,3],[1,1,1,2],[27,5,36,11],[5,2,5,3],[6,2,6,3],[7,2,7,3],[8,2,8,3],[21,2,21,3],[2,3,2,4],[9,2,9,3],[10,2,10,3],[11,2,11,3],[12,2,12,3],[13,2,13,3]]}
["Glaze Worksheet"]
[null,"<Recipe Name>",null,null,null,null,null,null,null,null,null,null,null,null,null,null,null,null,null,null,null,null,null,null,null,null,null,"  Glaze Ratio  Al:Si"]
[null,"Cone",6,"Atm",null,"Oxidation",null,null,null,null,null,null,null,null,null,null,null,null,null,null,null,null,null,null,null,null,null,0,0]
[]
[null,"Ingredient",{"$f":"CONCATENATE(\"Wt (\",UnitType,\")\")","v":"Wt (Grams)"},null,null,"Oxide Composition",{"$f":"IF(CurrentWorksheet!C31=\"\",\"\",CurrentWorksheet!C31)","v":"wt"},"%","RO Unity","R2O3 Unity",{"$f":"IF(CurrentWorksheet!D31=\"\",\"\",CurrentWorksheet!D31)","v":"moles"},"Mole%"]
[{"$f":"IF(B6=\"\",\"\",1)","v":""},null,null,null,null,{"$f":"IF(CurrentWorksheet!B32=\"\",\"\",CurrentWorksheet!B32)","v":""},{"$f":"IF(CurrentWorksheet!C32=\"\",\"\",CurrentWorksheet!C32)","v":""},{"$f":"IF(G6=\"\",\"\",G6/G$26)","v":""},{"$f":"IF(OR(K6=\"\",CurrentWorksheet!$I$52=0),\"\",K6/CurrentWorksheet!$I$52)","v":""},{"$f":"IF(OR(K6=\"\",AluminaMoles=\"\"),\"\",K6/AluminaMoles)","v":""},{"$f":"IF(CurrentWorksheet!D32=\"\",\"\",CurrentWorksheet!D32)","v":""},{"$f":"IF(K6=\"\",\"\",K6/K$26)","v":""}]
[{"$f":"IF(OR(B7=\"\",A6=\"\"),\"\",A6+1)","v":""},null,null,null,null,{"$f":"IF(CurrentWorksheet!B33=\"\",\"\",CurrentWorksheet!B33)","v":""},{"$f":"IF(CurrentWorksheet!C33=\"\",\"\",CurrentWorksheet!C33)","v":""},"",{"$f":"IF(OR(K7=\"\",CurrentWorksheet!$I$52=0),\"\",K7/CurrentWorksheet!$I$52)","v":""},{"$f":"IF(OR(K7=\"\",AluminaMoles=\"\"),\"\",K7/AluminaMoles)","v":""},{"$f":"IF(CurrentWorksheet!D33=\"\",\"\",CurrentWorksheet!D33)","v":""},""]
[{"$f":"IF(OR(B8=\"\",A7=\"\"),\"\",A7+1)","v":""},null,null,null,null,{"$f":"IF(CurrentWorksheet!B34=\"\",\"\",CurrentWorksheet!B34)","v":""},{"$f":"IF(CurrentWorksheet!C34=\"\",\"\",CurrentWorksheet!C34)","v":""},"",{"$f":"IF(OR(K8=\"\",CurrentWorksheet!$I$52=0),\"\",K8/CurrentWorksheet!$I$52)","v":""},"",{"$f":"IF(CurrentWorksheet!D34=\"\",\"\",CurrentWorksheet!D34)","v":""},""]
[{"$f":"IF(OR(B9=\"\",A8=\"\"),\"\",A8+1)","v":""},null,null,null,null,{"$f":"IF(CurrentWorksheet!B35=\"\",\"\",CurrentWorksheet!B35)","v":""},{"$f":"IF(CurrentWorksheet!C35=\"\",\"\",CurrentWorksheet!C35)","v":""},"",{"$f":"IF(OR(K9=\"\",CurrentWorksheet!$I$52=0),\"\",K9/CurrentWorksheet!$I$52)","v":""},"",{"$f":"IF(CurrentWorksheet!D35=\"\",\"\",CurrentWorksheet!D35)","v":""},""]
["",null,null,null,null,{"$f":"IF(CurrentWorksheet!B36=\"\",\"\",CurrentWorksheet!B36)","v":""},{"$f":"IF(CurrentWorksheet!C36=\"\",\"\",CurrentWorksheet!C36)","v":""},"",{"$f":"IF(OR(K10=\"\",CurrentWorksheet!$I$52=0),\"\",K10/CurrentWorksheet!$I$52)","v":""},"",{"$f":"IF(CurrentWorksheet!D36=\"\",\"\",CurrentWorksheet!D36)","v":""},""]
{"$rows_left_out":27}
{"sheet":"Mix Worksheet","index":1,"n_rows":37,"n_cols":15,"rows_kept":37,"cut":false,"hidden":false,"merged":[[1,6,1,7],[33,2,33,3],[2,6,2,7],[24,2,24,3],[27,2,27,3],[27,5,36,11],[28,2,28,3],[30,2,30,3],[31,2,31,3],[32,2,32,3],[35,2,35,3],[5,7,24,11],[20,2,20,3],[21,2,21,3],[13,2,13,3],[36,2,36,3],[18,2,18,3],[23,2,23,3],[14,2,14,3],[19,2,19,3],[22,2,22,3],[15,2,15,3],[17,2,17,3],[16,2,16,3],[1,1,1,2],[5,2,5,3],[6,2,6,3],[7,2,7,3],[12,2,12,3],[8,2,8,3],[9,2,9,3],[10,2,10,3],[11,2,11,3]]}
["Mix Worksheet"]
[null,{"$f":"IF('Recipe Sheet'!B2<>\"\",'Recipe Sheet'!B2:C2,\"\")","v":"<Recipe Name>"},null,null,null,"Atm",{"$f":"'Recipe Sheet'!F3","v":"Oxidation"},null,{"$f":"IF($F$3=\"Batch by Wt\",G3,J2)","v":""},{"$f":"IF(G3<>\"\",O3/(1+O5/O6),\"\")","v":""},null,{"$f":"IF(CurrentWorksheet!D27<>0,IF(F3<>\"Batch by Wt\",G3-C26/CurrentWorksheet!D27,G3*O5/O6),\"\")","v":""}]
[null,"Cone",{"$f":"'Recipe Sheet'!C3","v":6},null,null,"Batch by Vol",null,null,{"$f":"CONCATENATE(\" \",C37)","v":" ml"},"Sp Gr",1.4,null,null,null,{"$f":"G3*K3","v":0}]
[]
[null,"Ingredient",{"$f":"CONCATENATE(\"Wt (\",UnitType,\")\")","v":"Wt (Grams)"},null,null,"Added Amt",null,"Batch notes",null,null,null,null,null,{"$f":"(C26+C34)/(C34+C26/CurrentWorksheet!D27)","v":{"$error":"#VALUE!"}},{"$f":"1-K3/CurrentWorksheet!D27","v":{"$error":"#DIV/0!"}}]
[{"$f":"IF(B6=\"\",\"\",1)","v":""},{"$f":"IF('Recipe Sheet'!B6=\"\",\"\",'Recipe Sheet'!B6)","v":""},{"$f":"IF('Recipe Sheet'!C6=\"\",\"\",$I$2/'Recipe Sheet'!$C$26*'Recipe Sheet'!C6)","v":""},null,null,null,null,null,null,null,null,null,null,{"$f":"C26/CurrentWorksheet!D27+C34","v":{"$error":"#DIV/0!"}},{"$f":"K3-1","v":0.39999999999999991}]
[{"$f":"IF(B7=\"\",\"\",A6+1)","v":""},{"$f":"IF('Recipe Sheet'!B7=\"\",\"\",'Recipe Sheet'!B7)","v":""},{"$f":"IF('Recipe Sheet'!C7=\"\",\"\",$I$2/'Recipe Sheet'!$C$26*'Recipe Sheet'!C7)","v":""}]
["",{"$f":"IF('Recipe Sheet'!B8=\"\",\"\",'Recipe Sheet'!B8)","v":""},{"$f":"IF('Recipe Sheet'!C8=\"\",\"\",$I$2/'Recipe Sheet'!$C$26*'Recipe Sheet'!C8)","v":""}]
["",{"$f":"IF('Recipe Sheet'!B9=\"\",\"\",'Recipe Sheet'!B9)","v":""},{"$f":"IF('Recipe Sheet'!C9=\"\",\"\",$I$2/'Recipe Sheet'!$C$26*'Recipe Sheet'!C9)","v":""}]
["",{"$f":"IF('Recipe Sheet'!B10=\"\",\"\",'Recipe Sheet'!B10)","v":""},{"$f":"IF('Recipe Sheet'!C10=\"\",\"\",$I$2/'Recipe Sheet'!$C$26*'Recipe Sheet'!C10)","v":""}]
{"$rows_left_out":28}
{"sheet":"CurrentWorksheet","index":2,"n_rows":53,"n_cols":30,"rows_kept":53,"cut":false,"hidden":true,"merged":[]}
["Composition Worksheet",null,null,"Oxide",{"$f":"RawMaterialTable!D1","v":"BaO"},{"$f":"RawMaterialTable!E1","v":"CaO"},{"$f":"RawMaterialTable!F1","v":"PbO"},{"$f":"RawMaterialTable!G1","v":"Li2O"},{"$f":"RawMaterialTable!H1","v":"MgO"},{"$f":"RawMaterialTable!I1","v":"K2O"},{"$f":"RawMaterialTable!J1","v":"Na2O"},{"$f":"RawMaterialTable!K1","v":"SrO"},{"$f":"RawMaterialTable!L1","v":"ZnO"},{"$f":"RawMaterialTable!M1","v":"SnO2"},{"$f":"RawMaterialTable!N1","v":"TiO2"},{"$f":"RawMaterialTable!O1","v":"ZrO2"},{"$f":"RawMaterialTable!P1","v":"Al2O3"},{"$f":"RawMaterialTable!Q1","v":"B2O3"},{"$f":"RawMaterialTable!R1","v":"P2O5"},{"$f":"RawMaterialTable!S1","v":"SiO2"},{"$f":"RawMaterialTable!T1","v":"Fe2O3"},{"$f":"RawMaterialTable!U1","v":"Cr2O3"},{"$f":"RawMaterialTable!V1","v":"CuO"},{"$f":"RawMaterialTable!W1","v":"CoO"},{"$f":"RawMaterialTable!X1","v":"MnO"},"NiO",{"$f":"RawMaterialTable!Z1","v":"Available"},{"$f":"RawMaterialTable!AA1","v":0},{"$f":"RawMaterialTable!AB1","v":0},{"$f":"RawMaterialTable!AC1","v":"Price/Lb"}]
[null,null,null,"At Wt",{"$f":"RawMaterialTable!D2","v":153.33000000000001},{"$f":"RawMaterialTable!E2","v":56.08},{"$f":"RawMaterialTable!F2","v":223.2},{"$f":"RawMaterialTable!G2","v":29.881999999999998},{"$f":"RawMaterialTable!H2","v":40.31},{"$f":"RawMaterialTable!I2","v":94.2},{"$f":"RawMaterialTable!J2","v":61.98},{"$f":"RawMaterialTable!K2","v":103.62},{"$f":"RawMaterialTable!L2","v":81.39},{"$f":"RawMaterialTable!M2","v":150.70999999999998},{"$f":"RawMaterialTable!N2","v":79.87},{"$f":"RawMaterialTable!O2","v":123.22},{"$f":"RawMaterialTable!P2","v":101.96000000000001},{"$f":"RawMaterialTable!Q2","v":69.618200000000002},{"$f":"RawMaterialTable!R2","v":141.94},{"$f":"RawMaterialTable!S2","v":60.09},{"$f":"RawMaterialTable!T2","v":159.68},{"$f":"RawMaterialTable!U2","v":152},{"$f":"RawMaterialTable!V2","v":79.539999999999992},{"$f":"RawMaterialTable!W2","v":74.930000000000007},{"$f":"RawMaterialTable!X2","v":70.94},74.69,{"$f":"RawMaterialTable!Z2","v":0},{"$f":"RawMaterialTable!AA2","v":"<--Weight"},{"$f":"RawMaterialTable!AB2","v":0},{"$f":"RawMaterialTable!AC2","v":0}]
[null,null,null,"CoTE",{"$f":"RawMaterialTable!D3","v":7.166666666666667},{"$f":"RawMaterialTable!E3","v":7.2888888888888896},{"$f":"RawMaterialTable!F3","v":8.3000000000000007},{"$f":"RawMaterialTable!G3","v":6.8000000000000007},{"$f":"RawMaterialTable!H3","v":6.0000000000000009},{"$f":"RawMaterialTable!I3","v":33.1},{"$f":"RawMaterialTable!J3","v":38.700000000000003},{"$f":"RawMaterialTable!K3","v":7.4555555555555557},{"$f":"RawMaterialTable!L3","v":9.4},{"$f":"RawMaterialTable!M3","v":3.65},{"$f":"RawMaterialTable!N3","v":3.9666666666666668},{"$f":"RawMaterialTable!O3","v":2},{"$f":"RawMaterialTable!P3","v":3.0000000000000004},{"$f":"RawMaterialTable!Q3","v":3.1},{"$f":"RawMaterialTable!R3","v":7.1400000000000006},{"$f":"RawMaterialTable!S3","v":0.30555555555555552},{"$f":"RawMaterialTable!T3","v":5.7833333333333323},{"$f":"RawMaterialTable!U3","v":6.3333333333333339},{"$f":"RawMaterialTable!V3","v":3.5000000000000004},{"$f":"RawMaterialTable!W3","v":5.5555555555555562},{"$f":"RawMaterialTable!X3","v":5},8.8000000000000007,{"$f":"RawMaterialTable!Z3","v":0},{"$f":"RawMaterialTable!AA3","v":"<--Expansion"},{"$f":"RawMaterialTable!AB3","v":"Totality"},{"$f":"RawMaterialTable!AC3","v":0}]
[]
[]
["Cost","Materials ","Oxidation","Sp. Gr."]
[{"$f":"IF(OR($B7=\"\", $C7=\"\"),\"\",$C7*VLOOKUP($B7,MaterialsDB,3,FALSE)/VLOOKUP(UnitType,UnitConversionTable,2,FALSE))","v":""},{"$f":"IF('Recipe Sheet'!B6=\"\",\"\",'Recipe Sheet'!B6)","v":""},{"$f":"IF('Recipe Sheet'!C6=\"\",\"\",'Recipe Sheet'!C6)","v":""},{"$f":"IF(OR($B7=\"\", $C7=\"\"),\"\",$C7*VLOOKUP($B7,MaterialsDB,COLUMN(AD7),FALSE)/C$27)","v":""},{"$f":"IF(OR($B7=\"\", $C7=\"\"),\"\",$C7*VLOOKUP($B7,MaterialsDB,COLUMN(E7)-1,FALSE)/100)","v":""},{"$f":"IF(OR($B7=\"\", $C7=\"\"),\"\",$C7*VLOOKUP($B7,MaterialsDB,COLUMN(F7)-1,FALSE)/100)","v":""},"","","","","","","","","","","","","","","",{"$f":"IF(OR($B7=\"\", $C7=\"\"),\"\",$C7*VLOOKUP($B7,MaterialsDB,COLUMN(V7)-1,FALSE)/100)","v":""},"","","","","",""]
[{"$f":"IF(OR($B8=\"\", $C8=\"\"),\"\",$C8*VLOOKUP($B8,MaterialsDB,3,FALSE)/VLOOKUP(UnitType,UnitConversionTable,2,FALSE))","v":""},{"$f":"IF('Recipe Sheet'!B7=\"\",\"\",'Recipe Sheet'!B7)","v":""},{"$f":"IF('Recipe Sheet'!C7=\"\",\"\",'Recipe Sheet'!C7)","v":""},"",{"$f":"IF(OR($B8=\"\", $C8=\"\"),\"\",$C8*VLOOKUP($B8,MaterialsDB,COLUMN(E8)-1,FALSE)/100)","v":""},"","","","","","","","","","","","","","","","","","","","","","",""]
["",{"$f":"IF('Recipe Sheet'!B8=\"\",\"\",'Recipe Sheet'!B8)","v":""},{"$f":"IF('Recipe Sheet'!C8=\"\",\"\",'Recipe Sheet'!C8)","v":""},"","","","","","","","","","","","","","","","","","","","","","","","",""]
["",{"$f":"IF('Recipe Sheet'!B9=\"\",\"\",'Recipe Sheet'!B9)","v":""},{"$f":"IF('Recipe Sheet'!C9=\"\",\"\",'Recipe Sheet'!C9)","v":""},"","","","","","","","","","","","","","","","","","","","","","","","",""]
{"$rows_left_out":44}
{"sheet":"Conversion Worksheet","index":3,"n_rows":20,"n_cols":6,"rows_kept":20,"cut":false,"hidden":false,"merged":[]}
["Conversion Worksheet"]
[]
[]
["Weight Unit Conversion"]
[null,null,"in Kilograms","in Pounds","in Grams ","in Oz"]
["Unit ",null,{"$f":"IF(B6<>\"\",1/VLOOKUP($B6,Lists!$E4:$J7,COLUMN(C:C)-COLUMN($A:A)),\"\")","v":""},{"$f":"IF(C6<>\"\",1/VLOOKUP($B6,Lists!$E4:$J7,COLUMN(D:D)-COLUMN($A:B)),\"\")","v":""},{"$f":"IF(D6<>\"\",1/VLOOKUP($B6,Lists!$E4:$J7,COLUMN(E:E)-COLUMN($A:C)),\"\")","v":""},{"$f":"IF(E6<>\"\",1/VLOOKUP($B6,Lists!$E4:$J7,COLUMN(F:F)-COLUMN($A:D)),\"\")","v":""}]
["Amount",null,{"$f":"IF(AND($B6<>\"\",$B7<>\"\"),C6*$B7,\"\")","v":""},{"$f":"IF(AND($B6<>\"\",$B7<>\"\"),D6*$B7,\"\")","v":""},"",""]
[]
["Liquid Unit Conversion"]
[null,null,"in Liters","in ml","in Fl Oz","in Pints"]
{"$rows_left_out":11}
{"sheet":"Lists","index":4,"n_rows":355,"n_cols":19,"rows_kept":355,"cut":false,"hidden":true,"merged":[]}
[{"$f":"IF(RawMaterialTable!$A1=\"\",\"\",RawMaterialTable!$A1)","v":"Materials"}]
[{"$f":"IF(RawMaterialTable!$A2=\"\",\"\",RawMaterialTable!$A2)","v":""}]
[null,null,null,null,"Units","per kilo","per Lb","per gram","per Ounce","Same wt","Volume","per Liter","per ml","per Ounce","per Pint","Atmosphere","Batch_type"]
[{"$f":"IF(INDEX(RawMaterialTable!$A$4:$A$223,ROW(A4)-3,1)=\"\",\"\",INDEX(RawMaterialTable!$A$4:$A$223,ROW(A4)-3,1))","v":"Alumina Calcined"},null,null,null,"Grams",1000,454.5454545454545,1,28.409090909090907,"ml","Liters",1,1E-3,2.8409090909090908E-2,0.45454545454545453,"Oxidation","Batch by Wt"]
[{"$f":"IF(INDEX(RawMaterialTable!$A$4:$A$223,ROW(A5)-3,1)=\"\",\"\",INDEX(RawMaterialTable!$A$4:$A$223,ROW(A5)-3,1))","v":"Alumina Hydrate"},null,null,null,"Kilograms",1,0.45454545454545453,1E-3,2.8409090909090908E-2,"Liters","ml",1000,1,28.409090909090907,454.5454545454545,"Reduction","Batch by Vol"]
[{"$f":"IF(INDEX(RawMaterialTable!$A$4:$A$223,ROW(A6)-3,1)=\"\",\"\",INDEX(RawMaterialTable!$A$4:$A$223,ROW(A6)-3,1))","v":"A-3 Feldspar"},null,null,null,"Ounces",35.200000000000003,16,3.5200000000000002E-2,1,"Fl. Oz.","Ounces",35.200000000000003,3.5200000000000002E-2,1,16]
[{"$f":"IF(INDEX(RawMaterialTable!$A$4:$A$223,ROW(A7)-3,1)=\"\",\"\",INDEX(RawMaterialTable!$A$4:$A$223,ROW(A7)-3,1))","v":"AJAX Glomax Kaolin"},null,null,null,"Pounds",2.2000000000000002,1,2.2000000000000001E-3,6.25E-2,"Pints","Pints",2.2000000000000002,2.2000000000000001E-3,6.25E-2,1]
[{"$f":"IF(INDEX(RawMaterialTable!$A$4:$A$223,ROW(A8)-3,1)=\"\",\"\",INDEX(RawMaterialTable!$A$4:$A$223,ROW(A8)-3,1))","v":"AJAX P Kaolin"}]
[{"$f":"IF(INDEX(RawMaterialTable!$A$4:$A$223,ROW(A9)-3,1)=\"\",\"\",INDEX(RawMaterialTable!$A$4:$A$223,ROW(A9)-3,1))","v":"Albany Slip"}]
[{"$f":"IF(INDEX(RawMaterialTable!$A$4:$A$223,ROW(A10)-3,1)=\"\",\"\",INDEX(RawMaterialTable!$A$4:$A$223,ROW(A10)-3,1))","v":"Alberta Slip"},null,null,null,"Cone Values",null,null,"Alphabet",null,"Composition category",null,null,"Graph Plot Support"]
{"$rows_left_out":346}
{"sheet":"RawMaterialTable","index":5,"n_rows":226,"n_cols":33,"rows_kept":226,"cut":false,"hidden":true,"merged":[]}
["Materials","%LOI","Cost\\Oxide","BaO","CaO","PbO","Li2O","MgO","K2O","Na2O","SrO","ZnO","SnO2","TiO2","ZrO2","Al2O3","B2O3","P2O5","SiO2","Fe2O3","Cr2O3","CuO","CoO","MnO","NiO","Available",null,null,"Price/Lb","Density Eff",null,"Density","Source"]
[null,null,"mole Wt",{"$f":"Constants!F9","v":153.33000000000001},{"$f":"Constants!F10","v":56.08},{"$f":"Constants!F23","v":223.2},{"$f":"Constants!F17","v":29.881999999999998},{"$f":"Constants!F18","v":40.31},{"$f":"Constants!F16","v":94.2},{"$f":"Constants!F20","v":61.98},{"$f":"Constants!F26","v":103.62},{"$f":"Constants!F28","v":81.39},{"$f":"Constants!F25","v":150.70999999999998},{"$f":"Constants!F27","v":79.87},{"$f":"Constants!F29","v":123.22},{"$f":"Constants!F7","v":101.96000000000001},{"$f":"Constants!F8","v":69.618200000000002},{"$f":"Constants!F22","v":141.94},{"$f":"Constants!F24","v":60.09},{"$f":"Constants!F14","v":159.68},{"$f":"Constants!F12","v":152},{"$f":"Constants!F13","v":79.539999999999992},{"$f":"Constants!F11","v":74.930000000000007},{"$f":"Constants!F19","v":70.94},{"$f":"Constants!F21","v":74.69},0,"<--Weight",null,null,2.5]
[4,null,"oxide COE",{"$f":"VLOOKUP(D1, CoTE, $A3)","v":7.166666666666667},7.2888888888888896,8.3000000000000007,6.8000000000000007,6.0000000000000009,33.1,38.700000000000003,7.4555555555555557,9.4,3.65,3.9666666666666668,2,3.0000000000000004,3.1,7.1400000000000006,0.30555555555555552,5.7833333333333323,6.3333333333333339,3.5000000000000004,5.5555555555555562,5,5,0,"<--Expansion","Totality"]
["Alumina Calcined",null,{"$f":"IF(AC4<>\"\",AC4*2.2,0)","v":3.19},null,null,null,null,null,null,null,null,null,null,null,null,100,null,null,null,null,null,null,null,null,null,null,null,{"$f":"SUM(D4:Z4)+B4","v":100},1.45,{"$f":"IF(AF4=\"\",AD$2,AF4)","v":3.9870000000000001},null,3.9870000000000001]
["Alumina Hydrate",34.6,3.3000000000000003,null,null,null,null,null,null,null,null,null,null,null,null,65.38,null,null,null,null,null,null,null,null,null,null,null,{"$f":"SUM(D5:Z5)+B5","v":99.97999999999999},1.5,2.42,null,2.42]
["A-3 Feldspar",0.08,{"$f":"IF(AC6<>\"\",AC6*2.2,0)","v":0},null,0.4,null,null,null,7.5,4,null,null,null,null,null,16.3,null,null,71.63,7.0000000000000007E-2,null,null,null,null,null,null,null,99.97999999999999,null,2.56,null,2.56]
["AJAX Glomax Kaolin",0.378,{"$f":"IF(AC7<>\"\",AC7*2.2,0)","v":0},null,null,null,null,null,0.4,0.3,null,null,null,0.93,null,44.4,null,null,53.16,0.42,null,null,null,null,null,null,null,99.988,null,{"$f":"IF(AF7=\"\",AD$2,AF7)","v":2.42},null,{"$f":"AVERAGE(2.16,2.68)","v":2.42}]
["AJAX P Kaolin",13.4,0,null,0.25,null,null,0.3,0.04,null,null,null,null,1.9710000000000001,null,38.1,null,null,45.4,0.48,null,null,null,null,null,null,null,99.941000000000017,null,{"$f":"IF(AF8=\"\",AD$2,AF8)","v":2.35},null,2.35]
["Albany Slip",9.4,0,null,5.8,null,null,2.7,3.2,0.8,null,null,null,0.4,null,14.6,null,null,57.8,5.2,null,null,null,null,null,null,null,99.9,null,2.6,null,2.6]
["Alberta Slip",9.3000000000000007,5.3900000000000006,null,6.5,null,null,3.1,3,2.2000000000000002,null,null,null,0.4,null,13.8,null,0.1,56.8,4.8,null,null,null,null,null,null,null,100,2.4500000000000002,2.6,null,2.6]
{"$rows_left_out":217}
{"sheet":"About","index":6,"n_rows":0,"n_cols":0,"rows_kept":0,"cut":false,"hidden":false,"merged":[]}

{"sheet":"Constants","index":7,"n_rows":54,"n_cols":9,"rows_kept":54,"cut":false,"hidden":true,"merged":[]}
[]
[]
[]
[null,"Coefficients","Table 1","Table 2","Table 3",null,null,"Table 3 Overrides"]
[null,"& Constants","x10^4/F",null,"Dig Fire",null,null,"x10^4/F","x10^4/C"]
[null,null,"CoE","CoE","CoE","MW",null,100]
[null,"Al2O3",1.4E-2,1.4,{"$f":"H7*H$6","v":3.0000000000000004},{"$f":"C32*2+3*C46","v":101.96000000000001},null,{"$f":"I7*5/9","v":3.0000000000000002E-2},{"$f":"5.4/100","v":5.4000000000000006E-2}]
[null,"B2O3",-6.5000000000000002E-2,-6.53,{"$f":"H8*H$6","v":3.1},{"$f":"2*C33+3*15.9994","v":69.618200000000002},null,3.1E-2]
[null,"BaO",0.14000000000000001,14,{"$f":"H9*H$6","v":7.166666666666667},{"$f":"C34+C46","v":153.33000000000001},null,{"$f":"I9*5/9","v":7.166666666666667E-2},{"$f":"0.129","v":0.129}]
[null,"CaO",0.16300000000000001,16.3,7.2888888888888896,{"$f":"C35+16","v":56.08},null,{"$f":"I10*5/9","v":7.2888888888888892E-2},0.13120000000000001]
{"$rows_left_out":45}
{"sheet":"FAQ","index":8,"n_rows":0,"n_cols":0,"rows_kept":0,"cut":false,"hidden":false,"merged":[]}

{"sheet":"scratchSheet1","index":9,"n_rows":24,"n_cols":7,"rows_kept":24,"cut":false,"hidden":true,"merged":[]}
[{"$f":"scratchSheet1!#REF!","v":{"$error":"#REF!"}},"Weight",{"$f":"AND(ISNUMBER(D1), IF(NOT(ISNUMBER(D2)),FALSE,D2<>0))","v":true},{"$f":"scratchSheet1!$E$10:$E$10","v":0}]
[5,8,9,{"$f":"MDETERM(Matrix)","v":-0.77659580000000006}]
[]
[null,"Materials ","Wt (Grams)",null,"BaO","Al2O3","SiO2"]
[null,"Alumina Calcined",1,null,0,1,0]
[null,"Barium Carbonate",2,null,0.77659580000000006,0,0]
[null,"silica",3,null,0,0,1]
[null,null,null,null,"","",""]
[null,null,null,null,"","",""]
[null,null,null,null,0,1.2876711411521926,0]
{"$rows_left_out":14}