{"text_format":"1","workbook":"xlsx","n_sheets":10,"sheets":["Recipe Sheet","Mix Worksheet","CurrentWorksheet","Conversion Worksheet","Lists","RawMaterialTable","About","Constants","FAQ","scratchSheet1"],"not_rendered":{"charts":1,"images":0,"macros":1,"external_links":0,"defined_names":33,"comments":0,"pivot_tables":0},"unopened":[],"bounds":{"document_bytes":16777216,"sheet_cells":100000,"rows_first":2000,"rows_last":500,"rows_between":2000,"halvings":0,"cell_chars":16384,"cell_head_chars":4096},"cells_cut":0,"cells_raw":0,"read":"whole","date_system":"1900"}

{"sheet":"Recipe Sheet","index":0,"n_rows":36,"n_cols":29,"rows_kept":36,"cut":false,"hidden":false,"merged":[[32,2,32,3],[35,2,35,3],[27,2,27,3],[28,2,28,3],[30,2,30,3],[31,2,31,3],[22,2,22,3],[23,2,23,3],[24,2,24,3],[17,2,17,3],[18,2,18,3],[19,2,19,3],[20,2,20,3],[14,2,14,3],[15,2,15,3],[16,2,16,3],[1,1,1,2],[27,5,36,11],[5,2,5,3],[6,2,6,3],[7,2,7,3],[8,2,8,3],[21,2,21,3],[2,3,2,4],[9,2,9,3],[10,2,10,3],[11,2,11,3],[12,2,12,3],[13,2,13,3]]}
["Glaze Worksheet"]
[null,"<Recipe Name>",null,null,null,null,null,null,null,null,null,null,null,null,null,null,null,null,null,null,null,null,null,null,null,null,null,"  Glaze Ratio  Al:Si"]
[null,"Cone",6,"Atm",null,"Oxidation",null,null,null,null,null,null,null,null,null,null,null,null,null,null,null,null,null,null,null,null,null,0,0]
[]
[null,"Ingredient",{"$f":"CONCATENATE(\"Wt (\",UnitType,\")\")","v":"Wt (Grams)"},null,null,"Oxide Composition",{"$f":"IF(CurrentWorksheet!C31=\"\",\"\",CurrentWorksheet!C31)","v":"wt"},"%","RO Unity","R2O3 Unity",{"$f":"IF(CurrentWorksheet!D31=\"\",\"\",CurrentWorksheet!D31)","v":"moles"},"Mole%"]
[{"$f":"IF(B6=\"\",\"\",1)","v":""},null,null,null,null,{"$f":"IF(CurrentWorksheet!B32=\"\",\"\",CurrentWorksheet!B32)","v":""},{"$f":"IF(CurrentWorksheet!C32=\"\",\"\",CurrentWorksheet!C32)","v":""},{"$f":"IF(G6=\"\",\"\",G6/G$26)","v":""},{"$f":"IF(OR(K6=\"\",CurrentWorksheet!$I$52=0),\"\",K6/CurrentWorksheet!$I$52)","v":""},{"$f":"IF(OR(K6=\"\",AluminaMoles=\"\"),\"\",K6/AluminaMoles)","v":""},{"$f":"IF(CurrentWorksheet!D32=\"\",\"\",CurrentWorksheet!D32)","v":""},{"$f":"IF(K6=\"\",\"\",K6/K$26)","v":""}]
[{"$f":"IF(OR(B7=\"\",A6=\"\"),\"\",A6+1)","v":""},null,null,null,null,{"$f":"IF(CurrentWorksheet!B33=\"\",\"\",CurrentWorksheet!B33)","v":""},{"$f":"IF(CurrentWorksheet!C33=\"\",\"\",CurrentWorksheet!C33)","v":""},"",{"$f":"IF(OR(K7=\"\",CurrentWorksheet!$I$52=0),\"\",K7/CurrentWorksheet!$I$52)","v":""},{"$f":"IF(OR(K7=\"\",AluminaMoles=\"\"),\"\",K7/AluminaMoles)","v":""},{"$f":"IF(CurrentWorksheet!D33=\"\",\"\",CurrentWorksheet!D33)","v":""},""]
[{"$f":"IF(OR(B8=\"\",A7=\"\"),\"\",A7+1)","v":""},null,null,null,null,{"$f":"IF(CurrentWorksheet!B34=\"\",\"\",CurrentWorksheet!B34)","v":""},{"$f":"IF(CurrentWorksheet!C34=\"\",\"\",CurrentWorksheet!C34)","v":""},"",{"$f":"IF(OR(K8=\"\",CurrentWorksheet!$I$52=0),\"\",K8/CurrentWorksheet!$I$52)","v":""},"",{"$f":"IF(CurrentWorksheet!D34=\"\",\"\",CurrentWorksheet!D34)","v":""},""]
[{"$f":"IF(OR(B9=\"\",A8=\"\"),\"\",A8+1)","v":""},null,null,null,null,{"$f":"IF(CurrentWorksheet!B35=\"\",\"\",CurrentWorksheet!B35)","v":""},{"$f":"IF(CurrentWorksheet!C35=\"\",\"\",CurrentWorksheet!C35)","v":""},"",{"$f":"IF(OR(K9=\"\",CurrentWorksheet!$I$52=0),\"\",K9/CurrentWorksheet!$I$52)","v":""},"",{"$f":"IF(CurrentWorksheet!D35=\"\",\"\",CurrentWorksheet!D35)","v":""},""]
["",null,null,null,null,{"$f":"IF(CurrentWorksheet!B36=\"\",\"\",CurrentWorksheet!B36)","v":""},{"$f":"IF(CurrentWorksheet!C36=\"\",\"\",CurrentWorksheet!C36)","v":""},"",{"$f":"IF(OR(K10=\"\",CurrentWorksheet!$I$52=0),\"\",K10/CurrentWorksheet!$I$52)","v":""},"",{"$f":"IF(CurrentWorksheet!D36=\"\",\"\",CurrentWorksheet!D36)","v":""},""]
["",null,null,null,null,{"$f":"IF(CurrentWorksheet!B37=\"\",\"\",CurrentWorksheet!B37)","v":""},{"$f":"IF(CurrentWorksheet!C37=\"\",\"\",CurrentWorksheet!C37)","v":""},"",{"$f":"IF(OR(K11=\"\",CurrentWorksheet!$I$52=0),\"\",K11/CurrentWorksheet!$I$52)","v":""},"",{"$f":"IF(CurrentWorksheet!D37=\"\",\"\",CurrentWorksheet!D37)","v":""},""]
["",null,null,null,null,{"$f":"IF(CurrentWorksheet!B38=\"\",\"\",CurrentWorksheet!B38)","v":""},{"$f":"IF(CurrentWorksheet!C38=\"\",\"\",CurrentWorksheet!C38)","v":""},"",{"$f":"IF(OR(K12=\"\",CurrentWorksheet!$I$52=0),\"\",K12/CurrentWorksheet!$I$52)","v":""},"",{"$f":"IF(CurrentWorksheet!D38=\"\",\"\",CurrentWorksheet!D38)","v":""},""]
["",null,null,null,null,{"$f":"IF(CurrentWorksheet!B39=\"\",\"\",CurrentWorksheet!B39)","v":""},{"$f":"IF(CurrentWorksheet!C39=\"\",\"\",CurrentWorksheet!C39)","v":""},"",{"$f":"IF(OR(K13=\"\",CurrentWorksheet!$I$52=0),\"\",K13/CurrentWorksheet!$I$52)","v":""},"",{"$f":"IF(CurrentWorksheet!D39=\"\",\"\",CurrentWorksheet!D39)","v":""},""]
["",null,null,null,null,{"$f":"IF(CurrentWorksheet!B40=\"\",\"\",CurrentWorksheet!B40)","v":""},{"$f":"IF(CurrentWorksheet!C40=\"\",\"\",CurrentWorksheet!C40)","v":""},"",{"$f":"IF(OR(K14=\"\",CurrentWorksheet!$I$52=0),\"\",K14/CurrentWorksheet!$I$52)","v":""},"",{"$f":"IF(CurrentWorksheet!D40=\"\",\"\",CurrentWorksheet!D40)","v":""},""]
["",null,null,null,null,{"$f":"IF(CurrentWorksheet!B41=\"\",\"\",CurrentWorksheet!B41)","v":""},{"$f":"IF(CurrentWorksheet!C41=\"\",\"\",CurrentWorksheet!C41)","v":""},"",{"$f":"IF(OR(K15=\"\",CurrentWorksheet!$I$52=0),\"\",K15/CurrentWorksheet!$I$52)","v":""},"",{"$f":"IF(CurrentWorksheet!D41=\"\",\"\",CurrentWorksheet!D41)","v":""},""]
["",null,null,null,null,{"$f":"IF(CurrentWorksheet!B42=\"\",\"\",CurrentWorksheet!B42)","v":""},{"$f":"IF(CurrentWorksheet!C42=\"\",\"\",CurrentWorksheet!C42)","v":""},"",{"$f":"IF(OR(K16=\"\",CurrentWorksheet!$I$52=0),\"\",K16/CurrentWorksheet!$I$52)","v":""},"",{"$f":"IF(CurrentWorksheet!D42=\"\",\"\",CurrentWorksheet!D42)","v":""},""]
["",null,null,null,null,{"$f":"IF(CurrentWorksheet!B43=\"\",\"\",CurrentWorksheet!B43)","v":""},{"$f":"IF(CurrentWorksheet!C43=\"\",\"\",CurrentWorksheet!C43)","v":""},"",{"$f":"IF(OR(K17=\"\",CurrentWorksheet!$I$52=0),\"\",K17/CurrentWorksheet!$I$52)","v":""},"",{"$f":"IF(CurrentWorksheet!D43=\"\",\"\",CurrentWorksheet!D43)","v":""},""]
["",null,null,null,null,{"$f":"IF(CurrentWorksheet!B44=\"\",\"\",CurrentWorksheet!B44)","v":""},{"$f":"IF(CurrentWorksheet!C44=\"\",\"\",CurrentWorksheet!C44)","v":""},"",{"$f":"IF(OR(K18=\"\",CurrentWorksheet!$I$52=0),\"\",K18/CurrentWorksheet!$I$52)","v":""},"",{"$f":"IF(CurrentWorksheet!D44=\"\",\"\",CurrentWorksheet!D44)","v":""},""]
["",null,null,null,null,{"$f":"IF(CurrentWorksheet!B45=\"\",\"\",CurrentWorksheet!B45)","v":""},{"$f":"IF(CurrentWorksheet!C45=\"\",\"\",CurrentWorksheet!C45)","v":""},"",{"$f":"IF(OR(K19=\"\",CurrentWorksheet!$I$52=0),\"\",K19/CurrentWorksheet!$I$52)","v":""},"",{"$f":"IF(CurrentWorksheet!D45=\"\",\"\",CurrentWorksheet!D45)","v":""},""]
["",null,null,null,null,{"$f":"IF(CurrentWorksheet!B46=\"\",\"\",CurrentWorksheet!B46)","v":""},{"$f":"IF(CurrentWorksheet!C46=\"\",\"\",CurrentWorksheet!C46)","v":""},"",{"$f":"IF(OR(K20=\"\",CurrentWorksheet!$I$52=0),\"\",K20/CurrentWorksheet!$I$52)","v":""},"",{"$f":"IF(CurrentWorksheet!D46=\"\",\"\",CurrentWorksheet!D46)","v":""},""]
["",null,null,null,null,{"$f":"IF(CurrentWorksheet!B47=\"\",\"\",CurrentWorksheet!B47)","v":""},{"$f":"IF(CurrentWorksheet!C47=\"\",\"\",CurrentWorksheet!C47)","v":""},"",{"$f":"IF(OR(K21=\"\",CurrentWorksheet!$I$52=0),\"\",K21/CurrentWorksheet!$I$52)","v":""},"",{"$f":"IF(CurrentWorksheet!D47=\"\",\"\",CurrentWorksheet!D47)","v":""},""]
["",null,null,null,null,{"$f":"IF(CurrentWorksheet!B48=\"\",\"\",CurrentWorksheet!B48)","v":""},{"$f":"IF(CurrentWorksheet!C48=\"\",\"\",CurrentWorksheet!C48)","v":""},"",{"$f":"IF(OR(K22=\"\",CurrentWorksheet!$I$52=0),\"\",K22/CurrentWorksheet!$I$52)","v":""},"",{"$f":"IF(CurrentWorksheet!D48=\"\",\"\",CurrentWorksheet!D48)","v":""},""]
["",null,null,null,null,{"$f":"IF(CurrentWorksheet!B49=\"\",\"\",CurrentWorksheet!B49)","v":""},{"$f":"IF(CurrentWorksheet!C49=\"\",\"\",CurrentWorksheet!C49)","v":""},"",{"$f":"IF(OR(K23=\"\",CurrentWorksheet!$I$52=0),\"\",K23/CurrentWorksheet!$I$52)","v":""},"",{"$f":"IF(CurrentWorksheet!D49=\"\",\"\",CurrentWorksheet!D49)","v":""},""]
["",null,null,null,null,null,null,"",{"$f":"IF(OR(K24=\"\",CurrentWorksheet!$I$52=0),\"\",K24/CurrentWorksheet!$I$52)","v":""},"",null,""]
["",null,null,null,null,null,null,"",{"$f":"IF(OR(K25=\"\",CurrentWorksheet!$I$52=0),\"\",K25/CurrentWorksheet!$I$52)","v":""},"",null,""]
[null,"Totals",{"$f":"SUM(C6:D25)","v":0},null,null,null,{"$f":"SUM(G6:G25)","v":0},0,{"$f":"SUM(I6:I25)","v":0},{"$f":"SUM(J6:J25)","v":0},0,0]
[null,null,null,null,null,"Notes"]
[null,"SiO2:Al2O3 ratio",{"$f":"IF(CurrentWorksheet!M32=\"\",\"\",CurrentWorksheet!M33/CurrentWorksheet!M32)","v":""}]
[null,"RO:R2O3:RO2 ratio",{"$f":"'Mix Worksheet'!C29:D29","v":""}]
[null,"Coefficient of Expansion (F°)",{"$f":"IF(CurrentWorksheet!E52=\"\",\"\",ROUND(CurrentWorksheet!E52*10,1)&\"x10\")","v":""},{"$f":"IF(CurrentWorksheet!E52=\"\",\"\",-7)","v":""}]
[null,"Cost per Kilo",{"$f":"IF(CurrentWorksheet!C27=0,0,CurrentWorksheet!A27*VLOOKUP(UnitType,UnitConversionTable,2,FALSE)/CurrentWorksheet!C27)","v":0}]
[null,"Cost per Pound",{"$f":"IF(C31<>\"\",C31/2.2,\"\")","v":0}]
[null,"Cost for this amount",{"$f":"CurrentWorksheet!A27","v":0}]
[null,"R2O:RO ratio",{"$f":"CurrentWorksheet!C30","v":""}]
[]
[null,"Unit Weight","Grams"]

{"sheet":"Mix Worksheet","index":1,"n_rows":37,"n_cols":15,"rows_kept":37,"cut":false,"hidden":false,"merged":[[1,6,1,7],[33,2,33,3],[2,6,2,7],[24,2,24,3],[27,2,27,3],[27,5,36,11],[28,2,28,3],[30,2,30,3],[31,2,31,3],[32,2,32,3],[35,2,35,3],[5,7,24,11],[20,2,20,3],[21,2,21,3],[13,2,13,3],[36,2,36,3],[18,2,18,3],[23,2,23,3],[14,2,14,3],[19,2,19,3],[22,2,22,3],[15,2,15,3],[17,2,17,3],[16,2,16,3],[1,1,1,2],[5,2,5,3],[6,2,6,3],[7,2,7,3],[12,2,12,3],[8,2,8,3],[9,2,9,3],[10,2,10,3],[11,2,11,3]]}
["Mix Worksheet"]
[null,{"$f":"IF('Recipe Sheet'!B2<>\"\",'Recipe Sheet'!B2:C2,\"\")","v":"<Recipe Name>"},null,null,null,"Atm",{"$f":"'Recipe Sheet'!F3","v":"Oxidation"},null,{"$f":"IF($F$3=\"Batch by Wt\",G3,J2)","v":""},{"$f":"IF(G3<>\"\",O3/(1+O5/O6),\"\")","v":""},null,{"$f":"IF(CurrentWorksheet!D27<>0,IF(F3<>\"Batch by Wt\",G3-C26/CurrentWorksheet!D27,G3*O5/O6),\"\")","v":""}]
[null,"Cone",{"$f":"'Recipe Sheet'!C3","v":6},null,null,"Batch by Vol",null,null,{"$f":"CONCATENATE(\" \",C37)","v":" ml"},"Sp Gr",1.4,null,null,null,{"$f":"G3*K3","v":0}]
[]
[null,"Ingredient",{"$f":"CONCATENATE(\"Wt (\",UnitType,\")\")","v":"Wt (Grams)"},null,null,"Added Amt",null,"Batch notes",null,null,null,null,null,{"$f":"(C26+C34)/(C34+C26/CurrentWorksheet!D27)","v":{"$error":"#VALUE!"}},{"$f":"1-K3/CurrentWorksheet!D27","v":{"$error":"#DIV/0!"}}]
[{"$f":"IF(B6=\"\",\"\",1)","v":""},{"$f":"IF('Recipe Sheet'!B6=\"\",\"\",'Recipe Sheet'!B6)","v":""},{"$f":"IF('Recipe Sheet'!C6=\"\",\"\",$I$2/'Recipe Sheet'!$C$26*'Recipe Sheet'!C6)","v":""},null,null,null,null,null,null,null,null,null,null,{"$f":"C26/CurrentWorksheet!D27+C34","v":{"$error":"#DIV/0!"}},{"$f":"K3-1","v":0.39999999999999991}]
[{"$f":"IF(B7=\"\",\"\",A6+1)","v":""},{"$f":"IF('Recipe Sheet'!B7=\"\",\"\",'Recipe Sheet'!B7)","v":""},{"$f":"IF('Recipe Sheet'!C7=\"\",\"\",$I$2/'Recipe Sheet'!$C$26*'Recipe Sheet'!C7)","v":""}]
["",{"$f":"IF('Recipe Sheet'!B8=\"\",\"\",'Recipe Sheet'!B8)","v":""},{"$f":"IF('Recipe Sheet'!C8=\"\",\"\",$I$2/'Recipe Sheet'!$C$26*'Recipe Sheet'!C8)","v":""}]
["",{"$f":"IF('Recipe Sheet'!B9=\"\",\"\",'Recipe Sheet'!B9)","v":""},{"$f":"IF('Recipe Sheet'!C9=\"\",\"\",$I$2/'Recipe Sheet'!$C$26*'Recipe Sheet'!C9)","v":""}]
["",{"$f":"IF('Recipe Sheet'!B10=\"\",\"\",'Recipe Sheet'!B10)","v":""},{"$f":"IF('Recipe Sheet'!C10=\"\",\"\",$I$2/'Recipe Sheet'!$C$26*'Recipe Sheet'!C10)","v":""}]
["",{"$f":"IF('Recipe Sheet'!B11=\"\",\"\",'Recipe Sheet'!B11)","v":""},{"$f":"IF('Recipe Sheet'!C11=\"\",\"\",$I$2/'Recipe Sheet'!$C$26*'Recipe Sheet'!C11)","v":""}]
["",{"$f":"IF('Recipe Sheet'!B12=\"\",\"\",'Recipe Sheet'!B12)","v":""},{"$f":"IF('Recipe Sheet'!C12=\"\",\"\",$I$2/'Recipe Sheet'!$C$26*'Recipe Sheet'!C12)","v":""}]
["",{"$f":"IF('Recipe Sheet'!B13=\"\",\"\",'Recipe Sheet'!B13)","v":""},{"$f":"IF('Recipe Sheet'!C13=\"\",\"\",$I$2/'Recipe Sheet'!$C$26*'Recipe Sheet'!C13)","v":""}]
["",{"$f":"IF('Recipe Sheet'!B14=\"\",\"\",'Recipe Sheet'!B14)","v":""},{"$f":"IF('Recipe Sheet'!C14=\"\",\"\",$I$2/'Recipe Sheet'!$C$26*'Recipe Sheet'!C14)","v":""}]
["",{"$f":"IF('Recipe Sheet'!B15=\"\",\"\",'Recipe Sheet'!B15)","v":""},{"$f":"IF('Recipe Sheet'!C15=\"\",\"\",$I$2/'Recipe Sheet'!$C$26*'Recipe Sheet'!C15)","v":""}]
["",{"$f":"IF('Recipe Sheet'!B16=\"\",\"\",'Recipe Sheet'!B16)","v":""},{"$f":"IF('Recipe Sheet'!C16=\"\",\"\",$I$2/'Recipe Sheet'!$C$26*'Recipe Sheet'!C16)","v":""}]
["",{"$f":"IF('Recipe Sheet'!B17=\"\",\"\",'Recipe Sheet'!B17)","v":""},{"$f":"IF('Recipe Sheet'!C17=\"\",\"\",$I$2/'Recipe Sheet'!$C$26*'Recipe Sheet'!C17)","v":""}]
["",{"$f":"IF('Recipe Sheet'!B18=\"\",\"\",'Recipe Sheet'!B18)","v":""},{"$f":"IF('Recipe Sheet'!C18=\"\",\"\",$I$2/'Recipe Sheet'!$C$26*'Recipe Sheet'!C18)","v":""}]
["",{"$f":"IF('Recipe Sheet'!B19=\"\",\"\",'Recipe Sheet'!B19)","v":""},{"$f":"IF('Recipe Sheet'!C19=\"\",\"\",$I$2/'Recipe Sheet'!$C$26*'Recipe Sheet'!C19)","v":""}]
["",{"$f":"IF('Recipe Sheet'!B20=\"\",\"\",'Recipe Sheet'!B20)","v":""},{"$f":"IF('Recipe Sheet'!C20=\"\",\"\",$I$2/'Recipe Sheet'!$C$26*'Recipe Sheet'!C20)","v":""}]
["",{"$f":"IF('Recipe Sheet'!B21=\"\",\"\",'Recipe Sheet'!B21)","v":""},{"$f":"IF('Recipe Sheet'!C21=\"\",\"\",$I$2/'Recipe Sheet'!$C$26*'Recipe Sheet'!C21)","v":""}]
["",{"$f":"IF('Recipe Sheet'!B22=\"\",\"\",'Recipe Sheet'!B22)","v":""},{"$f":"IF('Recipe Sheet'!C22=\"\",\"\",$I$2/'Recipe Sheet'!$C$26*'Recipe Sheet'!C22)","v":""}]
["",{"$f":"IF('Recipe Sheet'!B23=\"\",\"\",'Recipe Sheet'!B23)","v":""},{"$f":"IF('Recipe Sheet'!C23=\"\",\"\",$I$2/'Recipe Sheet'!$C$26*'Recipe Sheet'!C23)","v":""}]
["",{"$f":"IF('Recipe Sheet'!B24=\"\",\"\",'Recipe Sheet'!B24)","v":""},{"$f":"IF('Recipe Sheet'!C24=\"\",\"\",$I$2/'Recipe Sheet'!$C$26*'Recipe Sheet'!C24)","v":""}]
["",{"$f":"IF('Recipe Sheet'!B25=\"\",\"\",'Recipe Sheet'!B25)","v":""},{"$f":"IF('Recipe Sheet'!C25=\"\",\"\",$I$2/'Recipe Sheet'!$C$26*'Recipe Sheet'!C25)","v":""}]
[null,"Totals",{"$f":"SUM(C6:D25)","v":0},null,null,{"$f":"SUM(F6:F25)","v":0}]
[null,null,null,null,null,"Notes"]
[null,{"$f":"'Recipe Sheet'!B28","v":"SiO2:Al2O3 ratio"},{"$f":"IF(CurrentWorksheet!M32=\"\",\"\",CurrentWorksheet!M33/CurrentWorksheet!M32)","v":""},null,null,{"$f":"IF('Recipe Sheet'!F28<>\"\",'Recipe Sheet'!F28:L37,\"\")","v":""}]
[null,{"$f":"'Recipe Sheet'!B29","v":"RO:R2O3:RO2 ratio"},{"$f":"CurrentWorksheet!C29","v":""}]
[null,{"$f":"'Recipe Sheet'!B30","v":"Coefficient of Expansion (F°)"},{"$f":"IF(CurrentWorksheet!E52=\"\",\"\",ROUND(CurrentWorksheet!E52*10,1)&\"x10\")","v":""},{"$f":"IF(CurrentWorksheet!E52=\"\",\"\",-7)","v":""}]
[null,{"$f":"'Recipe Sheet'!B31","v":"Cost per Kilo"},{"$f":"'Recipe Sheet'!C31:D31","v":0}]
[null,{"$f":"'Recipe Sheet'!B32","v":"Cost per Pound"},{"$f":"'Recipe Sheet'!C32:D32","v":0}]
[null,{"$f":"'Recipe Sheet'!B33","v":"Cost for this amount"},{"$f":"IF(CurrentWorksheet!A27<>0,C26/VLOOKUP(C36,UnitConversionTable,2)*C31,0)","v":0}]
[null,{"$f":"CONCATENATE(\"Water to add in \", C37)","v":"Water to add in ml"},{"$f":"IF(L2<>\"\",L2,\"\")","v":""}]
[]
[null,"Unit Weight",{"$f":"UnitType","v":"Grams"}]
[null,"Unit Volume",{"$f":"VLOOKUP(C36,UnitConversionTable,6)","v":"ml"}]

{"sheet":"CurrentWorksheet","index":2,"n_rows":53,"n_cols":30,"rows_kept":53,"cut":false,"hidden":true,"merged":[]}
["Composition Worksheet",null,null,"Oxide",{"$f":"RawMaterialTable!D1","v":"BaO"},{"$f":"RawMaterialTable!E1","v":"CaO"},{"$f":"RawMaterialTable!F1","v":"PbO"},{"$f":"RawMaterialTable!G1","v":"Li2O"},{"$f":"RawMaterialTable!H1","v":"MgO"},{"$f":"RawMaterialTable!I1","v":"K2O"},{"$f":"RawMaterialTable!J1","v":"Na2O"},{"$f":"RawMaterialTable!K1","v":"SrO"},{"$f":"RawMaterialTable!L1","v":"ZnO"},{"$f":"RawMaterialTable!M1","v":"SnO2"},{"$f":"RawMaterialTable!N1","v":"TiO2"},{"$f":"RawMaterialTable!O1","v":"ZrO2"},{"$f":"RawMaterialTable!P1","v":"Al2O3"},{"$f":"RawMaterialTable!Q1","v":"B2O3"},{"$f":"RawMaterialTable!R1","v":"P2O5"},{"$f":"RawMaterialTable!S1","v":"SiO2"},{"$f":"RawMaterialTable!T1","v":"Fe2O3"},{"$f":"RawMaterialTable!U1","v":"Cr2O3"},{"$f":"RawMaterialTable!V1","v":"CuO"},{"$f":"RawMaterialTable!W1","v":"CoO"},{"$f":"RawMaterialTable!X1","v":"MnO"},"NiO",{"$f":"RawMaterialTable!Z1","v":"Available"},{"$f":"RawMaterialTable!AA1","v":0},{"$f":"RawMaterialTable!AB1","v":0},{"$f":"RawMaterialTable!AC1","v":"Price/Lb"}]
[null,null,null,"At Wt",{"$f":"RawMaterialTable!D2","v":153.33000000000001},{"$f":"RawMaterialTable!E2","v":56.08},{"$f":"RawMaterialTable!F2","v":223.2},{"$f":"RawMaterialTable!G2","v":29.881999999999998},{"$f":"RawMaterialTable!H2","v":40.31},{"$f":"RawMaterialTable!I2","v":94.2},{"$f":"RawMaterialTable!J2","v":61.98},{"$f":"RawMaterialTable!K2","v":103.62},{"$f":"RawMaterialTable!L2","v":81.39},{"$f":"RawMaterialTable!M2","v":150.70999999999998},{"$f":"RawMaterialTable!N2","v":79.87},{"$f":"RawMaterialTable!O2","v":123.22},{"$f":"RawMaterialTable!P2","v":101.96000000000001},{"$f":"RawMaterialTable!Q2","v":69.618200000000002},{"$f":"RawMaterialTable!R2","v":141.94},{"$f":"RawMaterialTable!S2","v":60.09},{"$f":"RawMaterialTable!T2","v":159.68},{"$f":"RawMaterialTable!U2","v":152},{"$f":"RawMaterialTable!V2","v":79.539999999999992},{"$f":"RawMaterialTable!W2","v":74.930000000000007},{"$f":"RawMaterialTable!X2","v":70.94},74.69,{"$f":"RawMaterialTable!Z2","v":0},{"$f":"RawMaterialTable!AA2","v":"<--Weight"},{"$f":"RawMaterialTable!AB2","v":0},{"$f":"RawMaterialTable!AC2","v":0}]
[null,null,null,"CoTE",{"$f":"RawMaterialTable!D3","v":7.166666666666667},{"$f":"RawMaterialTable!E3","v":7.2888888888888896},{"$f":"RawMaterialTable!F3","v":8.3000000000000007},{"$f":"RawMaterialTable!G3","v":6.8000000000000007},{"$f":"RawMaterialTable!H3","v":6.0000000000000009},{"$f":"RawMaterialTable!I3","v":33.1},{"$f":"RawMaterialTable!J3","v":38.700000000000003},{"$f":"RawMaterialTable!K3","v":7.4555555555555557},{"$f":"RawMaterialTable!L3","v":9.4},{"$f":"RawMaterialTable!M3","v":3.65},{"$f":"RawMaterialTable!N3","v":3.9666666666666668},{"$f":"RawMaterialTable!O3","v":2},{"$f":"RawMaterialTable!P3","v":3.0000000000000004},{"$f":"RawMaterialTable!Q3","v":3.1},{"$f":"RawMaterialTable!R3","v":7.1400000000000006},{"$f":"RawMaterialTable!S3","v":0.30555555555555552},{"$f":"RawMaterialTable!T3","v":5.7833333333333323},{"$f":"RawMaterialTable!U3","v":6.3333333333333339},{"$f":"RawMaterialTable!V3","v":3.5000000000000004},{"$f":"RawMaterialTable!W3","v":5.5555555555555562},{"$f":"RawMaterialTable!X3","v":5},8.8000000000000007,{"$f":"RawMaterialTable!Z3","v":0},{"$f":"RawMaterialTable!AA3","v":"<--Expansion"},{"$f":"RawMaterialTable!AB3","v":"Totality"},{"$f":"RawMaterialTable!AC3","v":0}]
[]
[]
["Cost","Materials ","Oxidation","Sp. Gr."]
[{"$f":"IF(OR($B7=\"\", $C7=\"\"),\"\",$C7*VLOOKUP($B7,MaterialsDB,3,FALSE)/VLOOKUP(UnitType,UnitConversionTable,2,FALSE))","v":""},{"$f":"IF('Recipe Sheet'!B6=\"\",\"\",'Recipe Sheet'!B6)","v":""},{"$f":"IF('Recipe Sheet'!C6=\"\",\"\",'Recipe Sheet'!C6)","v":""},{"$f":"IF(OR($B7=\"\", $C7=\"\"),\"\",$C7*VLOOKUP($B7,MaterialsDB,COLUMN(AD7),FALSE)/C$27)","v":""},{"$f":"IF(OR($B7=\"\", $C7=\"\"),\"\",$C7*VLOOKUP($B7,MaterialsDB,COLUMN(E7)-1,FALSE)/100)","v":""},{"$f":"IF(OR($B7=\"\", $C7=\"\"),\"\",$C7*VLOOKUP($B7,MaterialsDB,COLUMN(F7)-1,FALSE)/100)","v":""},"","","","","","","","","","","","","","","",{"$f":"IF(OR($B7=\"\", $C7=\"\"),\"\",$C7*VLOOKUP($B7,MaterialsDB,COLUMN(V7)-1,FALSE)/100)","v":""},"","","","","",""]
[{"$f":"IF(OR($B8=\"\", $C8=\"\"),\"\",$C8*VLOOKUP($B8,MaterialsDB,3,FALSE)/VLOOKUP(UnitType,UnitConversionTable,2,FALSE))","v":""},{"$f":"IF('Recipe Sheet'!B7=\"\",\"\",'Recipe Sheet'!B7)","v":""},{"$f":"IF('Recipe Sheet'!C7=\"\",\"\",'Recipe Sheet'!C7)","v":""},"",{"$f":"IF(OR($B8=\"\", $C8=\"\"),\"\",$C8*VLOOKUP($B8,MaterialsDB,COLUMN(E8)-1,FALSE)/100)","v":""},"","","","","","","","","","","","","","","","","","","","","","",""]
["",{"$f":"IF('Recipe Sheet'!B8=\"\",\"\",'Recipe Sheet'!B8)","v":""},{"$f":"IF('Recipe Sheet'!C8=\"\",\"\",'Recipe Sheet'!C8)","v":""},"","","","","","","","","","","","","","","","","","","","","","","","",""]
["",{"$f":"IF('Recipe Sheet'!B9=\"\",\"\",'Recipe Sheet'!B9)","v":""},{"$f":"IF('Recipe Sheet'!C9=\"\",\"\",'Recipe Sheet'!C9)","v":""},"","","","","","","","","","","","","","","","","","","","","","","","",""]
["",{"$f":"IF('Recipe Sheet'!B10=\"\",\"\",'Recipe Sheet'!B10)","v":""},{"$f":"IF('Recipe Sheet'!C10=\"\",\"\",'Recipe Sheet'!C10)","v":""},"","","","","","","","","","","","","","","","","","","","","","","","",""]
["",{"$f":"IF('Recipe Sheet'!B11=\"\",\"\",'Recipe Sheet'!B11)","v":""},{"$f":"IF('Recipe Sheet'!C11=\"\",\"\",'Recipe Sheet'!C11)","v":""},"","","","","","","","","","","","","","","","","","","","","","","","",""]
["",{"$f":"IF('Recipe Sheet'!B12=\"\",\"\",'Recipe Sheet'!B12)","v":""},{"$f":"IF('Recipe Sheet'!C12=\"\",\"\",'Recipe Sheet'!C12)","v":""},"","","","","","","","","","","","","","","","","","","","","","","","",""]
["",{"$f":"IF('Recipe Sheet'!B13=\"\",\"\",'Recipe Sheet'!B13)","v":""},{"$f":"IF('Recipe Sheet'!C13=\"\",\"\",'Recipe Sheet'!C13)","v":""},"","","","","","","","","","","","","","","","","","","","","","","","",""]
["",{"$f":"IF('Recipe Sheet'!B14=\"\",\"\",'Recipe Sheet'!B14)","v":""},{"$f":"IF('Recipe Sheet'!C14=\"\",\"\",'Recipe Sheet'!C14)","v":""},"","","","","","","","","","","","","","","","","","","","","","","","",""]
["",{"$f":"IF('Recipe Sheet'!B15=\"\",\"\",'Recipe Sheet'!B15)","v":""},{"$f":"IF('Recipe Sheet'!C15=\"\",\"\",'Recipe Sheet'!C15)","v":""},"","","","","","","","","","","","","","","","","","","","","","","","",""]
["",{"$f":"IF('Recipe Sheet'!B16=\"\",\"\",'Recipe Sheet'!B16)","v":""},{"$f":"IF('Recipe Sheet'!C16=\"\",\"\",'Recipe Sheet'!C16)","v":""},"","","","","","","","","","","","","","","","","","","","","","","","",""]
["",{"$f":"IF('Recipe Sheet'!B17=\"\",\"\",'Recipe Sheet'!B17)","v":""},{"$f":"IF('Recipe Sheet'!C17=\"\",\"\",'Recipe Sheet'!C17)","v":""},"","","","","","","","","","","","","","","","","","","","","","","","",""]
["",{"$f":"IF('Recipe Sheet'!B18=\"\",\"\",'Recipe Sheet'!B18)","v":""},{"$f":"IF('Recipe Sheet'!C18=\"\",\"\",'Recipe Sheet'!C18)","v":""},"","","","","","","","","","","","","","","","","","","","","","","","",""]
["",{"$f":"IF('Recipe Sheet'!B19=\"\",\"\",'Recipe Sheet'!B19)","v":""},{"$f":"IF('Recipe Sheet'!C19=\"\",\"\",'Recipe Sheet'!C19)","v":""},"","","","","","","","","","","","","","","","","","","","","","","","",""]
["",{"$f":"IF('Recipe Sheet'!B20=\"\",\"\",'Recipe Sheet'!B20)","v":""},{"$f":"IF('Recipe Sheet'!C20=\"\",\"\",'Recipe Sheet'!C20)","v":""},"","","","","","","","","","","","","","","","","","","","","","","","",""]
["",{"$f":"IF('Recipe Sheet'!B21=\"\",\"\",'Recipe Sheet'!B21)","v":""},{"$f":"IF('Recipe Sheet'!C21=\"\",\"\",'Recipe Sheet'!C21)","v":""},"","","","","","","","","","","","","","","","","",{"$f":"IF(OR($B22=\"\", $C22=\"\"),\"\",$C22*VLOOKUP($B22,MaterialsDB,COLUMN(U22)-1,FALSE)/100)","v":""},"","","","","","",""]
["",{"$f":"IF('Recipe Sheet'!B22=\"\",\"\",'Recipe Sheet'!B22)","v":""},{"$f":"IF('Recipe Sheet'!C22=\"\",\"\",'Recipe Sheet'!C22)","v":""},"","",{"$f":"IF(OR($B23=\"\", $C23=\"\"),\"\",$C23*VLOOKUP($B23,MaterialsDB,COLUMN(F23)-1,FALSE)/100)","v":""},"","","","","","","","","","","","","","","","","","","","","",""]
["",{"$f":"IF('Recipe Sheet'!B23=\"\",\"\",'Recipe Sheet'!B23)","v":""},{"$f":"IF('Recipe Sheet'!C23=\"\",\"\",'Recipe Sheet'!C23)","v":""},"",{"$f":"IF(OR($B24=\"\", $C24=\"\"),\"\",$C24*VLOOKUP($B24,MaterialsDB,COLUMN(E24)-1,FALSE)/100)","v":""},"","","","","","","","","","","","","","","","","","","","","","",""]
[{"$f":"IF(OR($B25=\"\", $C25=\"\"),\"\",$C25*VLOOKUP($B25,MaterialsDB,3,FALSE)/VLOOKUP(UnitType,UnitConversionTable,2,FALSE))","v":""},{"$f":"IF('Recipe Sheet'!B24=\"\",\"\",'Recipe Sheet'!B24)","v":""},{"$f":"IF('Recipe Sheet'!C24=\"\",\"\",'Recipe Sheet'!C24)","v":""},"","","","","","","","","","","","","","","","","","","","","","","","",""]
["",{"$f":"IF('Recipe Sheet'!B25=\"\",\"\",'Recipe Sheet'!B25)","v":""},{"$f":"IF('Recipe Sheet'!C25=\"\",\"\",'Recipe Sheet'!C25)","v":""},"","","","","","","","","","","","","","","","","","","","","","","","",""]
[{"$f":"SUM(A7:A26)","v":0},"Totals",{"$f":"SUM(C7:C26)","v":0},{"$f":"SUM(D7:D26)","v":0},{"$f":"IF(SUM(E7:E26)=0,\"\",SUM(E7:E26))","v":""},{"$f":"IF(SUM(F7:F26)=0,\"\",SUM(F7:F26))","v":""},{"$f":"IF(SUM(G7:G26)=0,\"\",SUM(G7:G26))","v":""},"","","","","","","","","","","","","","","",{"$f":"IF(SUM(W7:W26)=0,\"\",SUM(W7:W26))","v":""},{"$f":"IF(SUM(X7:X26)=0,\"\",SUM(X7:X26))","v":""},{"$f":"IF(SUM(Y7:Y26)=0,\"\",SUM(Y7:Y26))","v":""},{"$f":"IF(SUM(Z7:Z26)=0,\"\",SUM(Z7:Z26))","v":""},{"$f":"IF(SUM(AA7:AA26)=0,\"\",SUM(AA7:AA26))","v":""}]
[null,"Moles",{"$f":"SUM(E28:Y28)","v":0},null,{"$f":"IF(E27=\"\",\"\",E27/E2)","v":""},{"$f":"IF(F27=\"\",\"\",F27/F2)","v":""},"","","","","","","","","","","","","","","","",{"$f":"IF(W27=\"\",\"\",W27/W2)","v":""},{"$f":"IF(X27=\"\",\"\",X27/X2)","v":""},{"$f":"IF(Y27=\"\",\"\",Y27/Y2)","v":""},{"$f":"IF(Z27=\"\",\"\",Z27/Z2)","v":""},{"$f":"IF(AA27=\"\",\"\",AA27/AA2)","v":""}]
[null,"RO:R2O3:RO2 Ratio",{"$f":"IF(OR(M34 = 0,M33 = \"\",M32 = \"\",M34 = \"\"),\"\",CONCATENATE(\"1.0 : \",ROUND(M32/M34,2),\" : \",ROUND(M33/M34,2)))","v":""}]
[null,"R2O:RO Ratio",{"$f":"IF(OR(H53=0,H53=\"\",I53=\"\",I53=\"\"),\"\",CONCATENATE(\"1.0 : \",ROUND(H53/I53,2),2))","v":""}]
[null,"Composition","wt","moles","CoTE",null,"Flux Oxides","wt","moles",null,"Misc","wt","moles"]
[]
[]
[]
[]
[]
[]
[]
[]
[]
[]
[]
[]
[]
[]
[]
[]
[]
[]
[]
[]
[null,null,{"$f":"SUM(C32:C51)","v":0},{"$f":"SUM(D32:D51)","v":0},null,null,null,{"$f":"SUM(H32:H51)","v":0},{"$f":"SUM(I32:I51)","v":0}]
[null,null,null,null,null,null,"RO:R2O"]

{"sheet":"Conversion Worksheet","index":3,"n_rows":20,"n_cols":6,"rows_kept":20,"cut":false,"hidden":false,"merged":[]}
["Conversion Worksheet"]
[]
[]
["Weight Unit Conversion"]
[null,null,"in Kilograms","in Pounds","in Grams ","in Oz"]
["Unit ",null,{"$f":"IF(B6<>\"\",1/VLOOKUP($B6,Lists!$E4:$J7,COLUMN(C:C)-COLUMN($A:A)),\"\")","v":""},{"$f":"IF(C6<>\"\",1/VLOOKUP($B6,Lists!$E4:$J7,COLUMN(D:D)-COLUMN($A:B)),\"\")","v":""},{"$f":"IF(D6<>\"\",1/VLOOKUP($B6,Lists!$E4:$J7,COLUMN(E:E)-COLUMN($A:C)),\"\")","v":""},{"$f":"IF(E6<>\"\",1/VLOOKUP($B6,Lists!$E4:$J7,COLUMN(F:F)-COLUMN($A:D)),\"\")","v":""}]
["Amount",null,{"$f":"IF(AND($B6<>\"\",$B7<>\"\"),C6*$B7,\"\")","v":""},{"$f":"IF(AND($B6<>\"\",$B7<>\"\"),D6*$B7,\"\")","v":""},"",""]
[]
["Liquid Unit Conversion"]
[null,null,"in Liters","in ml","in Fl Oz","in Pints"]
["Unit ",null,{"$f":"IF(B11<>\"\",1/VLOOKUP($B11,Lists!$K4:$O7,COLUMN(C:C)-COLUMN($A:A)),\"\")","v":""},{"$f":"IF(C11<>\"\",1/VLOOKUP($B11,Lists!$K4:$O7,COLUMN(D:D)-COLUMN($A:B)),\"\")","v":""},{"$f":"IF(D11<>\"\",1/VLOOKUP($B11,Lists!$K4:$O7,COLUMN(E:E)-COLUMN($A:C)),\"\")","v":""},{"$f":"IF(E11<>\"\",1/VLOOKUP($B11,Lists!$K4:$O7,COLUMN(F:F)-COLUMN($A:D)),\"\")","v":""}]
["Amount",null,{"$f":"IF(AND($B11<>\"\",$B12<>\"\"),C11*$B12,\"\")","v":""},{"$f":"IF(AND($B11<>\"\",$B12<>\"\"),D11*$B12,\"\")","v":""},"",""]
[]
["Change Specific Gravity of Glaze",null,null,null,"Calc Sp Gr"]
["(Works with ounces or metric, only)"]
["Initial Volume",null,null,null,"Tare"]
["Initial Specific Gravity",null,null,null,"Water"]
["Target Specific Gravity",null,null,null,"Glaze"]
["Final Volume",null,{"$f":"IF(AND(C17<>\"\",C18<>\"\", C16<>\"\",C18>1),C16+C16*((C17-C18)/(C18-1)),\"\")","v":""},null,"Sp Gr",{"$f":"IF(AND(F17<>\"\", F18<>\"\", F17<F18), (F18-F16)/(F17-F16),\"\")","v":""}]
["Water to add",null,{"$f":"IF(AND(C16<>\"\", C19<>\"\"),C19-C16,\"\")","v":""}]

{"sheet":"Lists","index":4,"n_rows":355,"n_cols":19,"rows_kept":355,"cut":false,"hidden":true,"merged":[]}
[{"$f":"IF(RawMaterialTable!$A1=\"\",\"\",RawMaterialTable!$A1)","v":"Materials"}]
[{"$f":"IF(RawMaterialTable!$A2=\"\",\"\",RawMaterialTable!$A2)","v":""}]
[null,null,null,null,"Units","per kilo","per Lb","per gram","per Ounce","Same wt","Volume","per Liter","per ml","per Ounce","per Pint","Atmosphere","Batch_type"]
[{"$f":"IF(INDEX(RawMaterialTable!$A$4:$A$223,ROW(A4)-3,1)=\"\",\"\",INDEX(RawMaterialTable!$A$4:$A$223,ROW(A4)-3,1))","v":"Alumina Calcined"},null,null,null,"Grams",1000,454.5454545454545,1,28.409090909090907,"ml","Liters",1,1E-3,2.8409090909090908E-2,0.45454545454545453,"Oxidation","Batch by Wt"]
[{"$f":"IF(INDEX(RawMaterialTable!$A$4:$A$223,ROW(A5)-3,1)=\"\",\"\",INDEX(RawMaterialTable!$A$4:$A$223,ROW(A5)-3,1))","v":"Alumina Hydrate"},null,null,null,"Kilograms",1,0.45454545454545453,1E-3,2.8409090909090908E-2,"Liters","ml",1000,1,28.409090909090907,454.5454545454545,"Reduction","Batch by Vol"]
[{"$f":"IF(INDEX(RawMaterialTable!$A$4:$A$223,ROW(A6)-3,1)=\"\",\"\",INDEX(RawMaterialTable!$A$4:$A$223,ROW(A6)-3,1))","v":"A-3 Feldspar"},null,null,null,"Ounces",35.200000000000003,16,3.5200000000000002E-2,1,"Fl. Oz.","Ounces",35.200000000000003,3.5200000000000002E-2,1,16]
[{"$f":"IF(INDEX(RawMaterialTable!$A$4:$A$223,ROW(A7)-3,1)=\"\",\"\",INDEX(RawMaterialTable!$A$4:$A$223,ROW(A7)-3,1))","v":"AJAX Glomax Kaolin"},null,null,null,"Pounds",2.2000000000000002,1,2.2000000000000001E-3,6.25E-2,"Pints","Pints",2.2000000000000002,2.2000000000000001E-3,6.25E-2,1]
[{"$f":"IF(INDEX(RawMaterialTable!$A$4:$A$223,ROW(A8)-3,1)=\"\",\"\",INDEX(RawMaterialTable!$A$4:$A$223,ROW(A8)-3,1))","v":"AJAX P Kaolin"}]
[{"$f":"IF(INDEX(RawMaterialTable!$A$4:$A$223,ROW(A9)-3,1)=\"\",\"\",INDEX(RawMaterialTable!$A$4:$A$223,ROW(A9)-3,1))","v":"Albany Slip"}]
[{"$f":"IF(INDEX(RawMaterialTable!$A$4:$A$223,ROW(A10)-3,1)=\"\",\"\",INDEX(RawMaterialTable!$A$4:$A$223,ROW(A10)-3,1))","v":"Alberta Slip"},null,null,null,"Cone Values",null,null,"Alphabet",null,"Composition category",null,null,"Graph Plot Support"]
[{"$f":"IF(INDEX(RawMaterialTable!$A$4:$A$223,ROW(A11)-3,1)=\"\",\"\",INDEX(RawMaterialTable!$A$4:$A$223,ROW(A11)-3,1))","v":"Alberta Slip II"},null,null,null,"020",null,null,"A",null,"Weight"]
[{"$f":"IF(INDEX(RawMaterialTable!$A$4:$A$223,ROW(A12)-3,1)=\"\",\"\",INDEX(RawMaterialTable!$A$4:$A$223,ROW(A12)-3,1))","v":"Anhydrous Borax"},null,null,null,"019",null,null,"B",null,"Moles"]
[{"$f":"IF(INDEX(RawMaterialTable!$A$4:$A$223,ROW(A13)-3,1)=\"\",\"\",INDEX(RawMaterialTable!$A$4:$A$223,ROW(A13)-3,1))","v":"Ash, Oak"},null,null,null,"018",null,null,"C"]
[{"$f":"IF(INDEX(RawMaterialTable!$A$4:$A$223,ROW(A14)-3,1)=\"\",\"\",INDEX(RawMaterialTable!$A$4:$A$223,ROW(A14)-3,1))","v":"Ash, Hardwood"},null,null,null,"017",null,null,"D",null,null,null,null,null,"Slope","Incr","Zone 1",null,"Line Data"]
[{"$f":"IF(INDEX(RawMaterialTable!$A$4:$A$223,ROW(A15)-3,1)=\"\",\"\",INDEX(RawMaterialTable!$A$4:$A$223,ROW(A15)-3,1))","v":"Ash, Pine"},null,null,null,"016",null,null,"E",null,null,null,null,null,9,0.01,0.26,2.41,0,0]
[{"$f":"IF(INDEX(RawMaterialTable!$A$4:$A$223,ROW(A16)-3,1)=\"\",\"\",INDEX(RawMaterialTable!$A$4:$A$223,ROW(A16)-3,1))","v":"Ash, softwood"},null,null,null,"015",null,null,"F",null,null,null,null,null,"Eutectic",null,0.20499999999999999,3,{"$f":"R15+O$15","v":0.01},{"$f":"R16*N$15","v":0.09}]
[{"$f":"IF(INDEX(RawMaterialTable!$A$4:$A$223,ROW(A17)-3,1)=\"\",\"\",INDEX(RawMaterialTable!$A$4:$A$223,ROW(A17)-3,1))","v":"BALL CLAY"},null,null,null,"014",null,null,"G",null,null,null,null,null,0.3,3,0.39300000000000002,3,0.02,0.18]
[{"$f":"IF(INDEX(RawMaterialTable!$A$4:$A$223,ROW(A18)-3,1)=\"\",\"\",INDEX(RawMaterialTable!$A$4:$A$223,ROW(A18)-3,1))","v":"Baking Soda"},null,null,null,"013",null,null,"H",null,null,null,null,null,null,null,0.2,2.7,0.03,0.27]
[{"$f":"IF(INDEX(RawMaterialTable!$A$4:$A$223,ROW(A19)-3,1)=\"\",\"\",INDEX(RawMaterialTable!$A$4:$A$223,ROW(A19)-3,1))","v":"Barium Carbonate"},null,null,null,"012",null,null,"I",null,null,null,null,null,"Zone 3",null,0.37,2.74,0.04,0.36]
[{"$f":"IF(INDEX(RawMaterialTable!$A$4:$A$223,ROW(A20)-3,1)=\"\",\"\",INDEX(RawMaterialTable!$A$4:$A$223,ROW(A20)-3,1))","v":"Barnard Clay"},null,null,null,"011",null,null,"J",null,null,null,null,null,0.4,2,0.22,2.5,0.05,0.45]
[{"$f":"IF(INDEX(RawMaterialTable!$A$4:$A$223,ROW(A21)-3,1)=\"\",\"\",INDEX(RawMaterialTable!$A$4:$A$223,ROW(A21)-3,1))","v":"Bell Dark Ball Clay"},null,null,null,"010",null,null,"K",null,null,null,null,null,0.1,3.2,0.34,2.5499999999999998,6.0000000000000005E-2,0.54]
[{"$f":"IF(INDEX(RawMaterialTable!$A$4:$A$223,ROW(A22)-3,1)=\"\",\"\",INDEX(RawMaterialTable!$A$4:$A$223,ROW(A22)-3,1))","v":"Bell Feldspar"},null,null,null,"09",null,null,"L",null,null,null,null,null,0.20499999999999999,1.74,0.3,2.4500000000000002,7.0000000000000007E-2,0.63000000000000012]
[{"$f":"IF(INDEX(RawMaterialTable!$A$4:$A$223,ROW(A23)-3,1)=\"\",\"\",INDEX(RawMaterialTable!$A$4:$A$223,ROW(A23)-3,1))","v":"Bentolite L"},null,null,null,"08",null,null,"M",null,null,null,null,null,0.59499999999999997,3,0.4,3.25,0.08,0.72]
[{"$f":"IF(INDEX(RawMaterialTable!$A$4:$A$223,ROW(A24)-3,1)=\"\",\"\",INDEX(RawMaterialTable!$A$4:$A$223,ROW(A24)-3,1))","v":"Bentonite"},null,null,null,"07",null,null,"N",null,null,null,null,null,0.5,5.3,0.24,3.25,0.09,0.80999999999999994]
[{"$f":"IF(INDEX(RawMaterialTable!$A$4:$A$223,ROW(A25)-3,1)=\"\",\"\",INDEX(RawMaterialTable!$A$4:$A$223,ROW(A25)-3,1))","v":"Bone Ash"},null,null,null,"06",null,null,"O",null,null,null,null,null,0.4,5.2,0.28999999999999998,3.5,9.9999999999999992E-2,0.89999999999999991]
[{"$f":"IF(INDEX(RawMaterialTable!$A$4:$A$223,ROW(A26)-3,1)=\"\",\"\",INDEX(RawMaterialTable!$A$4:$A$223,ROW(A26)-3,1))","v":"Borax"},null,null,null,"05",null,null,"P",null,null,null,null,null,0.3,4.8499999999999996,0.38400000000000001,3.47,0.10999999999999999,0.98999999999999988]
[{"$f":"IF(INDEX(RawMaterialTable!$A$4:$A$223,ROW(A27)-3,1)=\"\",\"\",INDEX(RawMaterialTable!$A$4:$A$223,ROW(A27)-3,1))","v":"Borax 5 Mol"},null,null,null,"04",null,null,"Q",null,null,null,null,null,0.2,4.4000000000000004,0.34399999999999997,3.57,0.11999999999999998,1.0799999999999998]
[{"$f":"IF(INDEX(RawMaterialTable!$A$4:$A$223,ROW(A28)-3,1)=\"\",\"\",INDEX(RawMaterialTable!$A$4:$A$223,ROW(A28)-3,1))","v":"Boric Acid"},null,null,null,"03",null,null,"R",null,null,null,null,null,0.13500000000000001,3.7,"Zone 2",null,0.12999999999999998,1.1699999999999997]
[{"$f":"IF(INDEX(RawMaterialTable!$A$4:$A$223,ROW(A29)-3,1)=\"\",\"\",INDEX(RawMaterialTable!$A$4:$A$223,ROW(A29)-3,1))","v":"Buckingham Feldspar"},null,null,null,"02",null,null,"S",null,null,null,null,null,0.1,2.2999999999999998,0.2,1.9650000000000001,0.13999999999999999,1.2599999999999998]
[{"$f":"IF(INDEX(RawMaterialTable!$A$4:$A$223,ROW(A30)-3,1)=\"\",\"\",INDEX(RawMaterialTable!$A$4:$A$223,ROW(A30)-3,1))","v":"Boraq 1"},null,null,null,"01",null,null,"T",null,null,null,null,null,0.09,2.65,0.14299999999999999,2.5,0.15,1.3499999999999999]
[{"$f":"IF(INDEX(RawMaterialTable!$A$4:$A$223,ROW(A31)-3,1)=\"\",\"\",INDEX(RawMaterialTable!$A$4:$A$223,ROW(A31)-3,1))","v":"Boraq 2"},null,null,null,"1",null,null,"U",null,null,null,null,null,0.5,2.4500000000000002,0.155,3,0.16,1.44]
[{"$f":"IF(INDEX(RawMaterialTable!$A$4:$A$223,ROW(A32)-3,1)=\"\",\"\",INDEX(RawMaterialTable!$A$4:$A$223,ROW(A32)-3,1))","v":"Boraq 3"},null,null,null,"2",null,null,"V",null,null,null,null,null,0.3,1.75,0.17,2.19,0.17,1.53]
[{"$f":"IF(INDEX(RawMaterialTable!$A$4:$A$223,ROW(A33)-3,1)=\"\",\"\",INDEX(RawMaterialTable!$A$4:$A$223,ROW(A33)-3,1))","v":"Cadycal"},null,null,null,"3",null,null,"W",null,null,null,null,null,0.13,1.95,0.2,3.5,0.18000000000000002,1.62]
[{"$f":"IF(INDEX(RawMaterialTable!$A$4:$A$223,ROW(A34)-3,1)=\"\",\"\",INDEX(RawMaterialTable!$A$4:$A$223,ROW(A34)-3,1))","v":"Calcined Kaolin"},null,null,null,"4",null,null,"X",null,null,null,null,null,0.66,4.3,0.23,3.75,0.19000000000000003,1.7100000000000002]
[{"$f":"IF(INDEX(RawMaterialTable!$A$4:$A$223,ROW(A35)-3,1)=\"\",\"\",INDEX(RawMaterialTable!$A$4:$A$223,ROW(A35)-3,1))","v":"Calcium Borate"},null,null,null,"5",null,null,"Y",null,null,null,null,null,0.64,4.8,0.26,1.95,0.20000000000000004,1.8000000000000003]
[{"$f":"IF(INDEX(RawMaterialTable!$A$4:$A$223,ROW(A36)-3,1)=\"\",\"\",INDEX(RawMaterialTable!$A$4:$A$223,ROW(A36)-3,1))","v":"Calcium Carbonate"},null,null,null,"6",null,null,"Z",null,null,null,null,null,0.6,5.15,0.27500000000000002,4,0.21000000000000005,1.8900000000000003]
[{"$f":"IF(INDEX(RawMaterialTable!$A$4:$A$223,ROW(A37)-3,1)=\"\",\"\",INDEX(RawMaterialTable!$A$4:$A$223,ROW(A37)-3,1))","v":"Calcium Feldspar"},null,null,null,"7",null,null,null,null,null,null,null,null,0.64,3.6,0.3,2.0499999999999998,0.22000000000000006,1.9800000000000004]
[{"$f":"IF(INDEX(RawMaterialTable!$A$4:$A$223,ROW(A38)-3,1)=\"\",\"\",INDEX(RawMaterialTable!$A$4:$A$223,ROW(A38)-3,1))","v":"Calvert Clay"},null,null,null,"8",null,null,null,null,null,null,null,null,null,null,0.33500000000000002,4.3,0.23000000000000007,2.0700000000000007]
[{"$f":"IF(INDEX(RawMaterialTable!$A$4:$A$223,ROW(A39)-3,1)=\"\",\"\",INDEX(RawMaterialTable!$A$4:$A$223,ROW(A39)-3,1))","v":"Cedar Heights Fire"},null,null,null,"9",null,null,null,null,null,null,null,null,null,null,0.35,2.2200000000000002,0.24000000000000007,2.1600000000000006]
[{"$f":"IF(INDEX(RawMaterialTable!$A$4:$A$223,ROW(A40)-3,1)=\"\",\"\",INDEX(RawMaterialTable!$A$4:$A$223,ROW(A40)-3,1))","v":"Chesterfield Spar"},null,null,null,"10",null,null,null,null,null,null,null,null,null,null,0.4,4.4000000000000004,0.25000000000000006,2.2500000000000004]
[{"$f":"IF(INDEX(RawMaterialTable!$A$4:$A$223,ROW(A41)-3,1)=\"\",\"\",INDEX(RawMaterialTable!$A$4:$A$223,ROW(A41)-3,1))","v":"China Clay"},null,null,null,"11",null,null,null,null,null,null,null,null,null,null,0.4,2.42,0.26000000000000006,2.3400000000000007]
[{"$f":"IF(INDEX(RawMaterialTable!$A$4:$A$223,ROW(A42)-3,1)=\"\",\"\",INDEX(RawMaterialTable!$A$4:$A$223,ROW(A42)-3,1))","v":"Chromium Oxide"},null,null,null,"12",null,null,null,null,null,null,null,null,null,null,0.44,4.4000000000000004,0.27000000000000007,2.4300000000000006]
[{"$f":"IF(INDEX(RawMaterialTable!$A$4:$A$223,ROW(A43)-3,1)=\"\",\"\",INDEX(RawMaterialTable!$A$4:$A$223,ROW(A43)-3,1))","v":"CMC GUM"},null,null,null,null,null,null,null,null,null,null,null,null,null,null,0.45,2.75,0.28000000000000008,2.5200000000000009]
[{"$f":"IF(INDEX(RawMaterialTable!$A$4:$A$223,ROW(A44)-3,1)=\"\",\"\",INDEX(RawMaterialTable!$A$4:$A$223,ROW(A44)-3,1))","v":"ABC Colemanite"},null,null,null,null,null,null,null,null,null,null,null,null,null,null,0.48499999999999999,4.3,0.29000000000000009,2.6100000000000008]
[{"$f":"IF(INDEX(RawMaterialTable!$A$4:$A$223,ROW(A45)-3,1)=\"\",\"\",INDEX(RawMaterialTable!$A$4:$A$223,ROW(A45)-3,1))","v":"Colemanite"},null,null,null,null,null,null,null,null,null,null,null,null,null,null,0.5,3.15,0.3000000000000001,2.7000000000000011]
[{"$f":"IF(INDEX(RawMaterialTable!$A$4:$A$223,ROW(A46)-3,1)=\"\",\"\",INDEX(RawMaterialTable!$A$4:$A$223,ROW(A46)-3,1))","v":"Cobalt Carbonate"},null,null,null,null,null,null,null,null,null,null,null,null,null,null,0.52,4,0.31000000000000011,2.7900000000000009]
[{"$f":"IF(INDEX(RawMaterialTable!$A$4:$A$223,ROW(A47)-3,1)=\"\",\"\",INDEX(RawMaterialTable!$A$4:$A$223,ROW(A47)-3,1))","v":"Cobalt Oxide"},null,null,null,null,null,null,null,null,null,null,null,null,null,null,0.52500000000000002,3.6,0.32000000000000012,2.8800000000000012]
[{"$f":"IF(INDEX(RawMaterialTable!$A$4:$A$223,ROW(A48)-3,1)=\"\",\"\",INDEX(RawMaterialTable!$A$4:$A$223,ROW(A48)-3,1))","v":"Copper Carbonate"},null,null,null,null,null,null,null,null,null,null,null,null,null,null,null,null,{"$f":"R47+O$15","v":0.33000000000000013},{"$f":"R48*N$15","v":2.9700000000000011}]
[{"$f":"IF(INDEX(RawMaterialTable!$A$4:$A$223,ROW(A49)-3,1)=\"\",\"\",INDEX(RawMaterialTable!$A$4:$A$223,ROW(A49)-3,1))","v":"Copper (I)Oxide - Red"},null,null,null,null,null,null,null,null,null,null,null,null,null,null,null,null,0.34000000000000014,3.0600000000000014]
[{"$f":"IF(INDEX(RawMaterialTable!$A$4:$A$223,ROW(A50)-3,1)=\"\",\"\",INDEX(RawMaterialTable!$A$4:$A$223,ROW(A50)-3,1))","v":"Copper (II)Oxide - Black"},null,null,null,null,null,null,null,null,null,null,null,null,null,null,null,null,0.35000000000000014,3.1500000000000012]
[{"$f":"IF(INDEX(RawMaterialTable!$A$4:$A$223,ROW(A51)-3,1)=\"\",\"\",INDEX(RawMaterialTable!$A$4:$A$223,ROW(A51)-3,1))","v":"Cornwall Stone"},null,null,null,null,null,null,null,null,null,null,null,null,null,null,null,null,0.36000000000000015,3.2400000000000015]
[{"$f":"IF(INDEX(RawMaterialTable!$A$4:$A$223,ROW(A52)-3,1)=\"\",\"\",INDEX(RawMaterialTable!$A$4:$A$223,ROW(A52)-3,1))","v":"Cryolite"},null,null,null,null,null,null,null,null,null,null,null,null,null,null,null,null,0.37000000000000016,3.3300000000000014]
[{"$f":"IF(INDEX(RawMaterialTable!$A$4:$A$223,ROW(A53)-3,1)=\"\",\"\",INDEX(RawMaterialTable!$A$4:$A$223,ROW(A53)-3,1))","v":"Custer Feldspar"},null,null,null,null,null,null,null,null,null,null,null,null,null,null,null,null,0.38000000000000017,3.4200000000000017]
[{"$f":"IF(INDEX(RawMaterialTable!$A$4:$A$223,ROW(A54)-3,1)=\"\",\"\",INDEX(RawMaterialTable!$A$4:$A$223,ROW(A54)-3,1))","v":"Diamond Kaolin"},null,null,null,null,null,null,null,null,null,null,null,null,null,null,null,null,0.39000000000000018,3.5100000000000016]
[{"$f":"IF(INDEX(RawMaterialTable!$A$4:$A$223,ROW(A55)-3,1)=\"\",\"\",INDEX(RawMaterialTable!$A$4:$A$223,ROW(A55)-3,1))","v":"Dolomite"},null,null,null,null,null,null,null,null,null,null,null,null,null,null,null,null,0.40000000000000019,3.6000000000000019]
[{"$f":"IF(INDEX(RawMaterialTable!$A$4:$A$223,ROW(A56)-3,1)=\"\",\"\",INDEX(RawMaterialTable!$A$4:$A$223,ROW(A56)-3,1))","v":"English Kaolin"},null,null,null,null,null,null,null,null,null,null,null,null,null,null,null,null,0.4100000000000002,3.6900000000000017]
[{"$f":"IF(INDEX(RawMaterialTable!$A$4:$A$223,ROW(A57)-3,1)=\"\",\"\",INDEX(RawMaterialTable!$A$4:$A$223,ROW(A57)-3,1))","v":"EPK Kaolin"},null,null,null,null,null,null,null,null,null,null,null,null,null,null,null,null,0.42000000000000021,3.780000000000002]
[{"$f":"IF(INDEX(RawMaterialTable!$A$4:$A$223,ROW(A58)-3,1)=\"\",\"\",INDEX(RawMaterialTable!$A$4:$A$223,ROW(A58)-3,1))","v":"Eureka Feldspar"},null,null,null,null,null,null,null,null,null,null,null,null,null,null,null,null,0.43000000000000022,3.8700000000000019]
[{"$f":"IF(INDEX(RawMaterialTable!$A$4:$A$223,ROW(A59)-3,1)=\"\",\"\",INDEX(RawMaterialTable!$A$4:$A$223,ROW(A59)-3,1))","v":"F-4 Feldspar"},null,null,null,null,null,null,null,null,null,null,null,null,null,null,null,null,0.44000000000000022,3.9600000000000022]
[{"$f":"IF(INDEX(RawMaterialTable!$A$4:$A$223,ROW(A60)-3,1)=\"\",\"\",INDEX(RawMaterialTable!$A$4:$A$223,ROW(A60)-3,1))","v":"Fireclay, Hawthorne Missouri"},null,null,null,null,null,null,null,null,null,null,null,null,null,null,null,null,0.45000000000000023,4.0500000000000025]
[{"$f":"IF(INDEX(RawMaterialTable!$A$4:$A$223,ROW(A61)-3,1)=\"\",\"\",INDEX(RawMaterialTable!$A$4:$A$223,ROW(A61)-3,1))","v":"Fireclay, AP Green Missouri"},null,null,null,null,null,null,null,null,null,null,null,null,null,null,null,null,0.46000000000000024,4.1400000000000023]
[{"$f":"IF(INDEX(RawMaterialTable!$A$4:$A$223,ROW(A62)-3,1)=\"\",\"\",INDEX(RawMaterialTable!$A$4:$A$223,ROW(A62)-3,1))","v":"Flint"},null,null,null,null,null,null,null,null,null,null,null,null,null,null,null,null,0.47000000000000025,4.2300000000000022]
[{"$f":"IF(INDEX(RawMaterialTable!$A$4:$A$223,ROW(A63)-3,1)=\"\",\"\",INDEX(RawMaterialTable!$A$4:$A$223,ROW(A63)-3,1))","v":"Fluorspar"},null,null,null,null,null,null,null,null,null,null,null,null,null,null,null,null,0.48000000000000026,4.3200000000000021]
[{"$f":"IF(INDEX(RawMaterialTable!$A$4:$A$223,ROW(A64)-3,1)=\"\",\"\",INDEX(RawMaterialTable!$A$4:$A$223,ROW(A64)-3,1))","v":"FRIT 13"},null,null,null,null,null,null,null,null,null,null,null,null,null,null,null,null,0.49000000000000027,4.4100000000000028]
[{"$f":"IF(INDEX(RawMaterialTable!$A$4:$A$223,ROW(A65)-3,1)=\"\",\"\",INDEX(RawMaterialTable!$A$4:$A$223,ROW(A65)-3,1))","v":"FRIT 14"},null,null,null,null,null,null,null,null,null,null,null,null,null,null,null,null,0.50000000000000022,4.5000000000000018]
[{"$f":"IF(INDEX(RawMaterialTable!$A$4:$A$223,ROW(A66)-3,1)=\"\",\"\",INDEX(RawMaterialTable!$A$4:$A$223,ROW(A66)-3,1))","v":"FRIT 22"},null,null,null,null,null,null,null,null,null,null,null,null,null,null,null,null,0.51000000000000023,4.5900000000000016]
[{"$f":"IF(INDEX(RawMaterialTable!$A$4:$A$223,ROW(A67)-3,1)=\"\",\"\",INDEX(RawMaterialTable!$A$4:$A$223,ROW(A67)-3,1))","v":"FRIT 240"},null,null,null,null,null,null,null,null,null,null,null,null,null,null,null,null,0.52000000000000024,4.6800000000000024]
[{"$f":"IF(INDEX(RawMaterialTable!$A$4:$A$223,ROW(A68)-3,1)=\"\",\"\",INDEX(RawMaterialTable!$A$4:$A$223,ROW(A68)-3,1))","v":"FRIT 266"},null,null,null,null,null,null,null,null,null,null,null,null,null,null,null,null,0.53000000000000025,4.7700000000000022]
[{"$f":"IF(INDEX(RawMaterialTable!$A$4:$A$223,ROW(A69)-3,1)=\"\",\"\",INDEX(RawMaterialTable!$A$4:$A$223,ROW(A69)-3,1))","v":"FRIT 267"},null,null,null,null,null,null,null,null,null,null,null,null,null,null,null,null,0.54000000000000026,4.8600000000000021]
[{"$f":"IF(INDEX(RawMaterialTable!$A$4:$A$223,ROW(A70)-3,1)=\"\",\"\",INDEX(RawMaterialTable!$A$4:$A$223,ROW(A70)-3,1))","v":"FRIT 285"},null,null,null,null,null,null,null,null,null,null,null,null,null,null,null,null,0.55000000000000027,4.9500000000000028]
[{"$f":"IF(INDEX(RawMaterialTable!$A$4:$A$223,ROW(A71)-3,1)=\"\",\"\",INDEX(RawMaterialTable!$A$4:$A$223,ROW(A71)-3,1))","v":"FRIT 3110"},null,null,null,null,null,null,null,null,null,null,null,null,null,null,null,null,0.56000000000000028,5.0400000000000027]
[{"$f":"IF(INDEX(RawMaterialTable!$A$4:$A$223,ROW(A72)-3,1)=\"\",\"\",INDEX(RawMaterialTable!$A$4:$A$223,ROW(A72)-3,1))","v":"FRIT 3124"},null,null,null,null,null,null,null,null,null,null,null,null,null,null,null,null,0.57000000000000028,5.1300000000000026]
[{"$f":"IF(INDEX(RawMaterialTable!$A$4:$A$223,ROW(A73)-3,1)=\"\",\"\",INDEX(RawMaterialTable!$A$4:$A$223,ROW(A73)-3,1))","v":"FRIT 3134"},null,null,null,null,null,null,null,null,null,null,null,null,null,null,null,null,0.58000000000000029,5.2200000000000024]
[{"$f":"IF(INDEX(RawMaterialTable!$A$4:$A$223,ROW(A74)-3,1)=\"\",\"\",INDEX(RawMaterialTable!$A$4:$A$223,ROW(A74)-3,1))","v":"FRIT 316"},null,null,null,null,null,null,null,null,null,null,null,null,null,null,null,null,0.5900000000000003,5.3100000000000023]
[{"$f":"IF(INDEX(RawMaterialTable!$A$4:$A$223,ROW(A75)-3,1)=\"\",\"\",INDEX(RawMaterialTable!$A$4:$A$223,ROW(A75)-3,1))","v":"FRIT 3195"},null,null,null,null,null,null,null,null,null,null,null,null,null,null,null,null,0.60000000000000031,5.400000000000003]
[{"$f":"IF(INDEX(RawMaterialTable!$A$4:$A$223,ROW(A76)-3,1)=\"\",\"\",INDEX(RawMaterialTable!$A$4:$A$223,ROW(A76)-3,1))","v":"FRIT 3211"},null,null,null,null,null,null,null,null,null,null,null,null,null,null,null,null,0.61000000000000032,5.4900000000000029]
[{"$f":"IF(INDEX(RawMaterialTable!$A$4:$A$223,ROW(A77)-3,1)=\"\",\"\",INDEX(RawMaterialTable!$A$4:$A$223,ROW(A77)-3,1))","v":"FRIT 3249"},null,null,null,null,null,null,null,null,null,null,null,null,null,null,null,null,0.62000000000000033,5.5800000000000027]
[{"$f":"IF(INDEX(RawMaterialTable!$A$4:$A$223,ROW(A78)-3,1)=\"\",\"\",INDEX(RawMaterialTable!$A$4:$A$223,ROW(A78)-3,1))","v":"FRIT 3269"},null,null,null,null,null,null,null,null,null,null,null,null,null,null,null,null,0.63000000000000034,5.6700000000000035]
[{"$f":"IF(INDEX(RawMaterialTable!$A$4:$A$223,ROW(A79)-3,1)=\"\",\"\",INDEX(RawMaterialTable!$A$4:$A$223,ROW(A79)-3,1))","v":"FRIT 3278"},null,null,null,null,null,null,null,null,null,null,null,null,null,null,null,null,0.64000000000000035,5.7600000000000033]
[{"$f":"IF(INDEX(RawMaterialTable!$A$4:$A$223,ROW(A80)-3,1)=\"\",\"\",INDEX(RawMaterialTable!$A$4:$A$223,ROW(A80)-3,1))","v":"FRIT 3289"},null,null,null,null,null,null,null,null,null,null,null,null,null,null,null,null,{"$f":"R79+O$15","v":0.65000000000000036},{"$f":"R80*N$15","v":5.8500000000000032}]
[{"$f":"IF(INDEX(RawMaterialTable!$A$4:$A$223,ROW(A81)-3,1)=\"\",\"\",INDEX(RawMaterialTable!$A$4:$A$223,ROW(A81)-3,1))","v":"FRIT 3300"},null,null,null,null,null,null,null,null,null,null,null,null,null,null,null,null,0.66000000000000036,5.9400000000000031]
[{"$f":"IF(INDEX(RawMaterialTable!$A$4:$A$223,ROW(A82)-3,1)=\"\",\"\",INDEX(RawMaterialTable!$A$4:$A$223,ROW(A82)-3,1))","v":"FRIT 3304"},null,null,null,null,null,null,null,null,null,null,null,null,null,null,null,null,0.67000000000000037,6.0300000000000029]
[{"$f":"IF(INDEX(RawMaterialTable!$A$4:$A$223,ROW(A83)-3,1)=\"\",\"\",INDEX(RawMaterialTable!$A$4:$A$223,ROW(A83)-3,1))","v":"FRIT 3327"},null,null,null,null,null,null,null,null,null,null,null,null,null,null,null,null,0.68000000000000038,6.1200000000000037]
[{"$f":"IF(INDEX(RawMaterialTable!$A$4:$A$223,ROW(A84)-3,1)=\"\",\"\",INDEX(RawMaterialTable!$A$4:$A$223,ROW(A84)-3,1))","v":"FRIT 3419"},null,null,null,null,null,null,null,null,null,null,null,null,null,null,null,null,0.69000000000000039,6.2100000000000035]
[{"$f":"IF(INDEX(RawMaterialTable!$A$4:$A$223,ROW(A85)-3,1)=\"\",\"\",INDEX(RawMaterialTable!$A$4:$A$223,ROW(A85)-3,1))","v":"FRIT 3467"},null,null,null,null,null,null,null,null,null,null,null,null,null,null,null,null,0.7000000000000004,6.3000000000000034]
[{"$f":"IF(INDEX(RawMaterialTable!$A$4:$A$223,ROW(A86)-3,1)=\"\",\"\",INDEX(RawMaterialTable!$A$4:$A$223,ROW(A86)-3,1))","v":"FRIT 3481"},null,null,null,null,null,null,null,null,null,null,null,null,null,null,null,null,0.71000000000000041,6.3900000000000041]
[{"$f":"IF(INDEX(RawMaterialTable!$A$4:$A$223,ROW(A87)-3,1)=\"\",\"\",INDEX(RawMaterialTable!$A$4:$A$223,ROW(A87)-3,1))","v":"FRIT 349"},null,null,null,null,null,null,null,null,null,null,null,null,null,null,null,null,0.72000000000000042,6.480000000000004]
[{"$f":"IF(INDEX(RawMaterialTable!$A$4:$A$223,ROW(A88)-3,1)=\"\",\"\",INDEX(RawMaterialTable!$A$4:$A$223,ROW(A88)-3,1))","v":"FRIT 3602"},null,null,null,null,null,null,null,null,null,null,null,null,null,null,null,null,0.73000000000000043,6.5700000000000038]
[{"$f":"IF(INDEX(RawMaterialTable!$A$4:$A$223,ROW(A89)-3,1)=\"\",\"\",INDEX(RawMaterialTable!$A$4:$A$223,ROW(A89)-3,1))","v":"FRIT 439"},null,null,null,null,null,null,null,null,null,null,null,null,null,null,null,null,0.74000000000000044,6.6600000000000037]
[{"$f":"IF(INDEX(RawMaterialTable!$A$4:$A$223,ROW(A90)-3,1)=\"\",\"\",INDEX(RawMaterialTable!$A$4:$A$223,ROW(A90)-3,1))","v":"FRIT 54"},null,null,null,null,null,null,null,null,null,null,null,null,null,null,null,null,0.75000000000000044,6.7500000000000036]
[{"$f":"IF(INDEX(RawMaterialTable!$A$4:$A$223,ROW(A91)-3,1)=\"\",\"\",INDEX(RawMaterialTable!$A$4:$A$223,ROW(A91)-3,1))","v":"FRIT 67"},null,null,null,null,null,null,null,null,null,null,null,null,null,null,null,null,0.76000000000000045,6.8400000000000043]
[{"$f":"IF(INDEX(RawMaterialTable!$A$4:$A$223,ROW(A92)-3,1)=\"\",\"\",INDEX(RawMaterialTable!$A$4:$A$223,ROW(A92)-3,1))","v":"FRIT 83"},null,null,null,null,null,null,null,null,null,null,null,null,null,null,null,null,0.77000000000000046,6.9300000000000042]
[{"$f":"IF(INDEX(RawMaterialTable!$A$4:$A$223,ROW(A93)-3,1)=\"\",\"\",INDEX(RawMaterialTable!$A$4:$A$223,ROW(A93)-3,1))","v":"FRIT 938"},null,null,null,null,null,null,null,null,null,null,null,null,null,null,null,null,0.78000000000000047,7.020000000000004]
[{"$f":"IF(INDEX(RawMaterialTable!$A$4:$A$223,ROW(A94)-3,1)=\"\",\"\",INDEX(RawMaterialTable!$A$4:$A$223,ROW(A94)-3,1))","v":"FRIT B-40-C"},null,null,null,null,null,null,null,null,null,null,null,null,null,null,null,null,0.79000000000000048,7.1100000000000048]
[{"$f":"IF(INDEX(RawMaterialTable!$A$4:$A$223,ROW(A95)-3,1)=\"\",\"\",INDEX(RawMaterialTable!$A$4:$A$223,ROW(A95)-3,1))","v":"FRIT B-300"},null,null,null,null,null,null,null,null,null,null,null,null,null,null,null,null,0.80000000000000049,7.2000000000000046]
[{"$f":"IF(INDEX(RawMaterialTable!$A$4:$A$223,ROW(A96)-3,1)=\"\",\"\",INDEX(RawMaterialTable!$A$4:$A$223,ROW(A96)-3,1))","v":"FRIT CC-250"},null,null,null,null,null,null,null,null,null,null,null,null,null,null,null,null,0.8100000000000005,7.2900000000000045]
[{"$f":"IF(INDEX(RawMaterialTable!$A$4:$A$223,ROW(A97)-3,1)=\"\",\"\",INDEX(RawMaterialTable!$A$4:$A$223,ROW(A97)-3,1))","v":"FRIT CC-257"}]
[{"$f":"IF(INDEX(RawMaterialTable!$A$4:$A$223,ROW(A98)-3,1)=\"\",\"\",INDEX(RawMaterialTable!$A$4:$A$223,ROW(A98)-3,1))","v":"FRIT F-13"}]
[{"$f":"IF(INDEX(RawMaterialTable!$A$4:$A$223,ROW(A99)-3,1)=\"\",\"\",INDEX(RawMaterialTable!$A$4:$A$223,ROW(A99)-3,1))","v":"FRIT F-19"}]
[{"$f":"IF(INDEX(RawMaterialTable!$A$4:$A$223,ROW(A100)-3,1)=\"\",\"\",INDEX(RawMaterialTable!$A$4:$A$223,ROW(A100)-3,1))","v":"FRIT F-2"}]
[{"$f":"IF(INDEX(RawMaterialTable!$A$4:$A$223,ROW(A101)-3,1)=\"\",\"\",INDEX(RawMaterialTable!$A$4:$A$223,ROW(A101)-3,1))","v":"FRIT F-34"}]
[{"$f":"IF(INDEX(RawMaterialTable!$A$4:$A$223,ROW(A102)-3,1)=\"\",\"\",INDEX(RawMaterialTable!$A$4:$A$223,ROW(A102)-3,1))","v":"FRIT F-60"}]
[{"$f":"IF(INDEX(RawMaterialTable!$A$4:$A$223,ROW(A103)-3,1)=\"\",\"\",INDEX(RawMaterialTable!$A$4:$A$223,ROW(A103)-3,1))","v":"FRIT F-75"}]
[{"$f":"IF(INDEX(RawMaterialTable!$A$4:$A$223,ROW(A104)-3,1)=\"\",\"\",INDEX(RawMaterialTable!$A$4:$A$223,ROW(A104)-3,1))","v":"FRIT FZ-25"}]
[{"$f":"IF(INDEX(RawMaterialTable!$A$4:$A$223,ROW(A105)-3,1)=\"\",\"\",INDEX(RawMaterialTable!$A$4:$A$223,ROW(A105)-3,1))","v":"FRIT F-367"}]
[{"$f":"IF(INDEX(RawMaterialTable!$A$4:$A$223,ROW(A106)-3,1)=\"\",\"\",INDEX(RawMaterialTable!$A$4:$A$223,ROW(A106)-3,1))","v":"FRIT GF-111"}]
[{"$f":"IF(INDEX(RawMaterialTable!$A$4:$A$223,ROW(A107)-3,1)=\"\",\"\",INDEX(RawMaterialTable!$A$4:$A$223,ROW(A107)-3,1))","v":"FRIT GF-113"}]
[{"$f":"IF(INDEX(RawMaterialTable!$A$4:$A$223,ROW(A108)-3,1)=\"\",\"\",INDEX(RawMaterialTable!$A$4:$A$223,ROW(A108)-3,1))","v":"FRIT GF-115"}]
[{"$f":"IF(INDEX(RawMaterialTable!$A$4:$A$223,ROW(A109)-3,1)=\"\",\"\",INDEX(RawMaterialTable!$A$4:$A$223,ROW(A109)-3,1))","v":"FRIT GF-134"}]
[{"$f":"IF(INDEX(RawMaterialTable!$A$4:$A$223,ROW(A110)-3,1)=\"\",\"\",INDEX(RawMaterialTable!$A$4:$A$223,ROW(A110)-3,1))","v":"FRIT P-25"}]
[{"$f":"IF(INDEX(RawMaterialTable!$A$4:$A$223,ROW(A111)-3,1)=\"\",\"\",INDEX(RawMaterialTable!$A$4:$A$223,ROW(A111)-3,1))","v":"FRIT P-2950 (Lead Bisilicate)"}]
[{"$f":"IF(INDEX(RawMaterialTable!$A$4:$A$223,ROW(A112)-3,1)=\"\",\"\",INDEX(RawMaterialTable!$A$4:$A$223,ROW(A112)-3,1))","v":"FRIT P-311"}]
[{"$f":"IF(INDEX(RawMaterialTable!$A$4:$A$223,ROW(A113)-3,1)=\"\",\"\",INDEX(RawMaterialTable!$A$4:$A$223,ROW(A113)-3,1))","v":"FRIT P-54"}]
[{"$f":"IF(INDEX(RawMaterialTable!$A$4:$A$223,ROW(A114)-3,1)=\"\",\"\",INDEX(RawMaterialTable!$A$4:$A$223,ROW(A114)-3,1))","v":"G-200 Feldspar"}]
[{"$f":"IF(INDEX(RawMaterialTable!$A$4:$A$223,ROW(A115)-3,1)=\"\",\"\",INDEX(RawMaterialTable!$A$4:$A$223,ROW(A115)-3,1))","v":"G-200HP Feldspar"}]
[{"$f":"IF(INDEX(RawMaterialTable!$A$4:$A$223,ROW(A116)-3,1)=\"\",\"\",INDEX(RawMaterialTable!$A$4:$A$223,ROW(A116)-3,1))","v":"Gerstley Borate"}]
[{"$f":"IF(INDEX(RawMaterialTable!$A$4:$A$223,ROW(A117)-3,1)=\"\",\"\",INDEX(RawMaterialTable!$A$4:$A$223,ROW(A117)-3,1))","v":"Gillespie Borate"}]
[{"$f":"IF(INDEX(RawMaterialTable!$A$4:$A$223,ROW(A118)-3,1)=\"\",\"\",INDEX(RawMaterialTable!$A$4:$A$223,ROW(A118)-3,1))","v":"GK 129 Bentonite"}]
[{"$f":"IF(INDEX(RawMaterialTable!$A$4:$A$223,ROW(A119)-3,1)=\"\",\"\",INDEX(RawMaterialTable!$A$4:$A$223,ROW(A119)-3,1))","v":"Glacier 200 Talc"}]
[{"$f":"IF(INDEX(RawMaterialTable!$A$4:$A$223,ROW(A120)-3,1)=\"\",\"\",INDEX(RawMaterialTable!$A$4:$A$223,ROW(A120)-3,1))","v":"Glass Cullet"}]
[{"$f":"IF(INDEX(RawMaterialTable!$A$4:$A$223,ROW(A121)-3,1)=\"\",\"\",INDEX(RawMaterialTable!$A$4:$A$223,ROW(A121)-3,1))","v":"Gleason Ball Clay"}]
[{"$f":"IF(INDEX(RawMaterialTable!$A$4:$A$223,ROW(A122)-3,1)=\"\",\"\",INDEX(RawMaterialTable!$A$4:$A$223,ROW(A122)-3,1))","v":"Goldart"}]
[{"$f":"IF(INDEX(RawMaterialTable!$A$4:$A$223,ROW(A123)-3,1)=\"\",\"\",INDEX(RawMaterialTable!$A$4:$A$223,ROW(A123)-3,1))","v":"Grolleg Kaolin"}]
[{"$f":"IF(INDEX(RawMaterialTable!$A$4:$A$223,ROW(A124)-3,1)=\"\",\"\",INDEX(RawMaterialTable!$A$4:$A$223,ROW(A124)-3,1))","v":"Gunheath Kaolin"}]
[{"$f":"IF(INDEX(RawMaterialTable!$A$4:$A$223,ROW(A125)-3,1)=\"\",\"\",INDEX(RawMaterialTable!$A$4:$A$223,ROW(A125)-3,1))","v":"Hectalite"}]
[{"$f":"IF(INDEX(RawMaterialTable!$A$4:$A$223,ROW(A126)-3,1)=\"\",\"\",INDEX(RawMaterialTable!$A$4:$A$223,ROW(A126)-3,1))","v":"Helmer Kaolin"}]
[{"$f":"IF(INDEX(RawMaterialTable!$A$4:$A$223,ROW(A127)-3,1)=\"\",\"\",INDEX(RawMaterialTable!$A$4:$A$223,ROW(A127)-3,1))","v":"Ilmenite"}]
[{"$f":"IF(INDEX(RawMaterialTable!$A$4:$A$223,ROW(A128)-3,1)=\"\",\"\",INDEX(RawMaterialTable!$A$4:$A$223,ROW(A128)-3,1))","v":"Iron Oxide Black"}]
[{"$f":"IF(INDEX(RawMaterialTable!$A$4:$A$223,ROW(A129)-3,1)=\"\",\"\",INDEX(RawMaterialTable!$A$4:$A$223,ROW(A129)-3,1))","v":"Iron Oxide Red"}]
[{"$f":"IF(INDEX(RawMaterialTable!$A$4:$A$223,ROW(A130)-3,1)=\"\",\"\",INDEX(RawMaterialTable!$A$4:$A$223,ROW(A130)-3,1))","v":"Jackson Ball Clay"}]
[{"$f":"IF(INDEX(RawMaterialTable!$A$4:$A$223,ROW(A131)-3,1)=\"\",\"\",INDEX(RawMaterialTable!$A$4:$A$223,ROW(A131)-3,1))","v":"Jasper Slip"}]
[{"$f":"IF(INDEX(RawMaterialTable!$A$4:$A$223,ROW(A132)-3,1)=\"\",\"\",INDEX(RawMaterialTable!$A$4:$A$223,ROW(A132)-3,1))","v":"Jordan Fireclay"}]
[{"$f":"IF(INDEX(RawMaterialTable!$A$4:$A$223,ROW(A133)-3,1)=\"\",\"\",INDEX(RawMaterialTable!$A$4:$A$223,ROW(A133)-3,1))","v":"K&T Special"}]
[{"$f":"IF(INDEX(RawMaterialTable!$A$4:$A$223,ROW(A134)-3,1)=\"\",\"\",INDEX(RawMaterialTable!$A$4:$A$223,ROW(A134)-3,1))","v":"K-200 Feldspar"}]
[{"$f":"IF(INDEX(RawMaterialTable!$A$4:$A$223,ROW(A135)-3,1)=\"\",\"\",INDEX(RawMaterialTable!$A$4:$A$223,ROW(A135)-3,1))","v":"Kaolin"}]
[{"$f":"IF(INDEX(RawMaterialTable!$A$4:$A$223,ROW(A136)-3,1)=\"\",\"\",INDEX(RawMaterialTable!$A$4:$A$223,ROW(A136)-3,1))","v":"Kaopaque 20 Kaolin"}]
[{"$f":"IF(INDEX(RawMaterialTable!$A$4:$A$223,ROW(A137)-3,1)=\"\",\"\",INDEX(RawMaterialTable!$A$4:$A$223,ROW(A137)-3,1))","v":"Kingman Feldspar"}]
[{"$f":"IF(INDEX(RawMaterialTable!$A$4:$A$223,ROW(A138)-3,1)=\"\",\"\",INDEX(RawMaterialTable!$A$4:$A$223,ROW(A138)-3,1))","v":"Kentucky OM #4 Ball Clay"}]
[{"$f":"IF(INDEX(RawMaterialTable!$A$4:$A$223,ROW(A139)-3,1)=\"\",\"\",INDEX(RawMaterialTable!$A$4:$A$223,ROW(A139)-3,1))","v":"KTS-2 Ball Clay"}]
[{"$f":"IF(INDEX(RawMaterialTable!$A$4:$A$223,ROW(A140)-3,1)=\"\",\"\",INDEX(RawMaterialTable!$A$4:$A$223,ROW(A140)-3,1))","v":"KY Special"}]
[{"$f":"IF(INDEX(RawMaterialTable!$A$4:$A$223,ROW(A141)-3,1)=\"\",\"\",INDEX(RawMaterialTable!$A$4:$A$223,ROW(A141)-3,1))","v":"Kyanite"}]
[{"$f":"IF(INDEX(RawMaterialTable!$A$4:$A$223,ROW(A142)-3,1)=\"\",\"\",INDEX(RawMaterialTable!$A$4:$A$223,ROW(A142)-3,1))","v":"Laguna Borate"}]
[{"$f":"IF(INDEX(RawMaterialTable!$A$4:$A$223,ROW(A143)-3,1)=\"\",\"\",INDEX(RawMaterialTable!$A$4:$A$223,ROW(A143)-3,1))","v":"Lead Bisilicate"}]
[{"$f":"IF(INDEX(RawMaterialTable!$A$4:$A$223,ROW(A144)-3,1)=\"\",\"\",INDEX(RawMaterialTable!$A$4:$A$223,ROW(A144)-3,1))","v":"Lead Carbonate"}]
[{"$f":"IF(INDEX(RawMaterialTable!$A$4:$A$223,ROW(A145)-3,1)=\"\",\"\",INDEX(RawMaterialTable!$A$4:$A$223,ROW(A145)-3,1))","v":"Lepidolite"}]
[{"$f":"IF(INDEX(RawMaterialTable!$A$4:$A$223,ROW(A146)-3,1)=\"\",\"\",INDEX(RawMaterialTable!$A$4:$A$223,ROW(A146)-3,1))","v":"Litharge"}]
[{"$f":"IF(INDEX(RawMaterialTable!$A$4:$A$223,ROW(A147)-3,1)=\"\",\"\",INDEX(RawMaterialTable!$A$4:$A$223,ROW(A147)-3,1))","v":"Lithium Carbonate"}]
[{"$f":"IF(INDEX(RawMaterialTable!$A$4:$A$223,ROW(A148)-3,1)=\"\",\"\",INDEX(RawMaterialTable!$A$4:$A$223,ROW(A148)-3,1))","v":"Lithospar"}]
[{"$f":"IF(INDEX(RawMaterialTable!$A$4:$A$223,ROW(A149)-3,1)=\"\",\"\",INDEX(RawMaterialTable!$A$4:$A$223,ROW(A149)-3,1))","v":"M&D Ball Clay"}]
[{"$f":"IF(INDEX(RawMaterialTable!$A$4:$A$223,ROW(A150)-3,1)=\"\",\"\",INDEX(RawMaterialTable!$A$4:$A$223,ROW(A150)-3,1))","v":"Magnesium Carbonate"}]
[{"$f":"IF(INDEX(RawMaterialTable!$A$4:$A$223,ROW(A151)-3,1)=\"\",\"\",INDEX(RawMaterialTable!$A$4:$A$223,ROW(A151)-3,1))","v":"Manganese Carbonate"}]
[{"$f":"IF(INDEX(RawMaterialTable!$A$4:$A$223,ROW(A152)-3,1)=\"\",\"\",INDEX(RawMaterialTable!$A$4:$A$223,ROW(A152)-3,1))","v":"Manganese Dioxide. MnO2"}]
[{"$f":"IF(INDEX(RawMaterialTable!$A$4:$A$223,ROW(A153)-3,1)=\"\",\"\",INDEX(RawMaterialTable!$A$4:$A$223,ROW(A153)-3,1))","v":"Manganese Oxide. MnO"}]
[{"$f":"IF(INDEX(RawMaterialTable!$A$4:$A$223,ROW(A154)-3,1)=\"\",\"\",INDEX(RawMaterialTable!$A$4:$A$223,ROW(A154)-3,1))","v":"Minspar 200"}]
[{"$f":"IF(INDEX(RawMaterialTable!$A$4:$A$223,ROW(A155)-3,1)=\"\",\"\",INDEX(RawMaterialTable!$A$4:$A$223,ROW(A155)-3,1))","v":"Mullite"}]
[{"$f":"IF(INDEX(RawMaterialTable!$A$4:$A$223,ROW(A156)-3,1)=\"\",\"\",INDEX(RawMaterialTable!$A$4:$A$223,ROW(A156)-3,1))","v":"Murrays Borate"}]
[{"$f":"IF(INDEX(RawMaterialTable!$A$4:$A$223,ROW(A157)-3,1)=\"\",\"\",INDEX(RawMaterialTable!$A$4:$A$223,ROW(A157)-3,1))","v":"Nepheline Syenite"}]
[{"$f":"IF(INDEX(RawMaterialTable!$A$4:$A$223,ROW(A158)-3,1)=\"\",\"\",INDEX(RawMaterialTable!$A$4:$A$223,ROW(A158)-3,1))","v":"Nickel Oxide, green"}]
[{"$f":"IF(INDEX(RawMaterialTable!$A$4:$A$223,ROW(A159)-3,1)=\"\",\"\",INDEX(RawMaterialTable!$A$4:$A$223,ROW(A159)-3,1))","v":"NP Blend Ball Clay"}]
[{"$f":"IF(INDEX(RawMaterialTable!$A$4:$A$223,ROW(A160)-3,1)=\"\",\"\",INDEX(RawMaterialTable!$A$4:$A$223,ROW(A160)-3,1))","v":"Nytal Talc"}]
[{"$f":"IF(INDEX(RawMaterialTable!$A$4:$A$223,ROW(A161)-3,1)=\"\",\"\",INDEX(RawMaterialTable!$A$4:$A$223,ROW(A161)-3,1))","v":"Ocamulgee Red Clay"}]
[{"$f":"IF(INDEX(RawMaterialTable!$A$4:$A$223,ROW(A162)-3,1)=\"\",\"\",INDEX(RawMaterialTable!$A$4:$A$223,ROW(A162)-3,1))","v":"OM #4 Ball Clay"}]
[{"$f":"IF(INDEX(RawMaterialTable!$A$4:$A$223,ROW(A163)-3,1)=\"\",\"\",INDEX(RawMaterialTable!$A$4:$A$223,ROW(A163)-3,1))","v":"Oxford Feldspar"}]
[{"$f":"IF(INDEX(RawMaterialTable!$A$4:$A$223,ROW(A164)-3,1)=\"\",\"\",INDEX(RawMaterialTable!$A$4:$A$223,ROW(A164)-3,1))","v":"PBX Fireclay"}]
[{"$f":"IF(INDEX(RawMaterialTable!$A$4:$A$223,ROW(A165)-3,1)=\"\",\"\",INDEX(RawMaterialTable!$A$4:$A$223,ROW(A165)-3,1))","v":"Pearl Ash"}]
[{"$f":"IF(INDEX(RawMaterialTable!$A$4:$A$223,ROW(A166)-3,1)=\"\",\"\",INDEX(RawMaterialTable!$A$4:$A$223,ROW(A166)-3,1))","v":"Pearl Ash Calcined"}]
[{"$f":"IF(INDEX(RawMaterialTable!$A$4:$A$223,ROW(A167)-3,1)=\"\",\"\",INDEX(RawMaterialTable!$A$4:$A$223,ROW(A167)-3,1))","v":"Petalite"}]
[{"$f":"IF(INDEX(RawMaterialTable!$A$4:$A$223,ROW(A168)-3,1)=\"\",\"\",INDEX(RawMaterialTable!$A$4:$A$223,ROW(A168)-3,1))","v":"Pioneer Kaolin"}]
[{"$f":"IF(INDEX(RawMaterialTable!$A$4:$A$223,ROW(A169)-3,1)=\"\",\"\",INDEX(RawMaterialTable!$A$4:$A$223,ROW(A169)-3,1))","v":"Plastic Vitrox"}]
[{"$f":"IF(INDEX(RawMaterialTable!$A$4:$A$223,ROW(A170)-3,1)=\"\",\"\",INDEX(RawMaterialTable!$A$4:$A$223,ROW(A170)-3,1))","v":"Portland Cement"}]
[{"$f":"IF(INDEX(RawMaterialTable!$A$4:$A$223,ROW(A171)-3,1)=\"\",\"\",INDEX(RawMaterialTable!$A$4:$A$223,ROW(A171)-3,1))","v":"Potash Feldspar"}]
[{"$f":"IF(INDEX(RawMaterialTable!$A$4:$A$223,ROW(A172)-3,1)=\"\",\"\",INDEX(RawMaterialTable!$A$4:$A$223,ROW(A172)-3,1))","v":"Pumice"}]
[{"$f":"IF(INDEX(RawMaterialTable!$A$4:$A$223,ROW(A173)-3,1)=\"\",\"\",INDEX(RawMaterialTable!$A$4:$A$223,ROW(A173)-3,1))","v":"PC Clay"}]
[{"$f":"IF(INDEX(RawMaterialTable!$A$4:$A$223,ROW(A174)-3,1)=\"\",\"\",INDEX(RawMaterialTable!$A$4:$A$223,ROW(A174)-3,1))","v":"Pyrax Pyrophyllite"}]
[{"$f":"IF(INDEX(RawMaterialTable!$A$4:$A$223,ROW(A175)-3,1)=\"\",\"\",INDEX(RawMaterialTable!$A$4:$A$223,ROW(A175)-3,1))","v":"Pyrophyllite"}]
[{"$f":"IF(INDEX(RawMaterialTable!$A$4:$A$223,ROW(A176)-3,1)=\"\",\"\",INDEX(RawMaterialTable!$A$4:$A$223,ROW(A176)-3,1))","v":"Quartz"}]
[{"$f":"IF(INDEX(RawMaterialTable!$A$4:$A$223,ROW(A177)-3,1)=\"\",\"\",INDEX(RawMaterialTable!$A$4:$A$223,ROW(A177)-3,1))","v":"Ravenscrag Slip"}]
[{"$f":"IF(INDEX(RawMaterialTable!$A$4:$A$223,ROW(A178)-3,1)=\"\",\"\",INDEX(RawMaterialTable!$A$4:$A$223,ROW(A178)-3,1))","v":"Red Lead"}]
[{"$f":"IF(INDEX(RawMaterialTable!$A$4:$A$223,ROW(A179)-3,1)=\"\",\"\",INDEX(RawMaterialTable!$A$4:$A$223,ROW(A179)-3,1))","v":"Redart"}]
[{"$f":"IF(INDEX(RawMaterialTable!$A$4:$A$223,ROW(A180)-3,1)=\"\",\"\",INDEX(RawMaterialTable!$A$4:$A$223,ROW(A180)-3,1))","v":"Rutile"}]
[{"$f":"IF(INDEX(RawMaterialTable!$A$4:$A$223,ROW(A181)-3,1)=\"\",\"\",INDEX(RawMaterialTable!$A$4:$A$223,ROW(A181)-3,1))","v":"Saffer XX Ball Clay"}]
[{"$f":"IF(INDEX(RawMaterialTable!$A$4:$A$223,ROW(A182)-3,1)=\"\",\"\",INDEX(RawMaterialTable!$A$4:$A$223,ROW(A182)-3,1))","v":"Sheffield Slip"}]
[{"$f":"IF(INDEX(RawMaterialTable!$A$4:$A$223,ROW(A183)-3,1)=\"\",\"\",INDEX(RawMaterialTable!$A$4:$A$223,ROW(A183)-3,1))","v":"SIL-O-SPAR"}]
[{"$f":"IF(INDEX(RawMaterialTable!$A$4:$A$223,ROW(A184)-3,1)=\"\",\"\",INDEX(RawMaterialTable!$A$4:$A$223,ROW(A184)-3,1))","v":"Silica"}]
[{"$f":"IF(INDEX(RawMaterialTable!$A$4:$A$223,ROW(A185)-3,1)=\"\",\"\",INDEX(RawMaterialTable!$A$4:$A$223,ROW(A185)-3,1))","v":"Silica, SIL-CO-SIL 52"}]
[{"$f":"IF(INDEX(RawMaterialTable!$A$4:$A$223,ROW(A186)-3,1)=\"\",\"\",INDEX(RawMaterialTable!$A$4:$A$223,ROW(A186)-3,1))","v":"Sledge Ball Clay"}]
[{"$f":"IF(INDEX(RawMaterialTable!$A$4:$A$223,ROW(A187)-3,1)=\"\",\"\",INDEX(RawMaterialTable!$A$4:$A$223,ROW(A187)-3,1))","v":"Snobrite Kaolin"}]
[{"$f":"IF(INDEX(RawMaterialTable!$A$4:$A$223,ROW(A188)-3,1)=\"\",\"\",INDEX(RawMaterialTable!$A$4:$A$223,ROW(A188)-3,1))","v":"Soda Ash"}]
[{"$f":"IF(INDEX(RawMaterialTable!$A$4:$A$223,ROW(A189)-3,1)=\"\",\"\",INDEX(RawMaterialTable!$A$4:$A$223,ROW(A189)-3,1))","v":"Soda Feldspar"}]
[{"$f":"IF(INDEX(RawMaterialTable!$A$4:$A$223,ROW(A190)-3,1)=\"\",\"\",INDEX(RawMaterialTable!$A$4:$A$223,ROW(A190)-3,1))","v":"Spinks Blend Ball"}]
[{"$f":"IF(INDEX(RawMaterialTable!$A$4:$A$223,ROW(A191)-3,1)=\"\",\"\",INDEX(RawMaterialTable!$A$4:$A$223,ROW(A191)-3,1))","v":"Spodumene"}]
[{"$f":"IF(INDEX(RawMaterialTable!$A$4:$A$223,ROW(A192)-3,1)=\"\",\"\",INDEX(RawMaterialTable!$A$4:$A$223,ROW(A192)-3,1))","v":"Spruce Pine #4 Spar"}]
[{"$f":"IF(INDEX(RawMaterialTable!$A$4:$A$223,ROW(A193)-3,1)=\"\",\"\",INDEX(RawMaterialTable!$A$4:$A$223,ROW(A193)-3,1))","v":"Strontium Carbonate"}]
[{"$f":"IF(INDEX(RawMaterialTable!$A$4:$A$223,ROW(A194)-3,1)=\"\",\"\",INDEX(RawMaterialTable!$A$4:$A$223,ROW(A194)-3,1))","v":"Superpax"}]
[{"$f":"IF(INDEX(RawMaterialTable!$A$4:$A$223,ROW(A195)-3,1)=\"\",\"\",INDEX(RawMaterialTable!$A$4:$A$223,ROW(A195)-3,1))","v":"Talc"}]
[{"$f":"IF(INDEX(RawMaterialTable!$A$4:$A$223,ROW(A196)-3,1)=\"\",\"\",INDEX(RawMaterialTable!$A$4:$A$223,ROW(A196)-3,1))","v":"Talc, C-98"}]
[{"$f":"IF(INDEX(RawMaterialTable!$A$4:$A$223,ROW(A197)-3,1)=\"\",\"\",INDEX(RawMaterialTable!$A$4:$A$223,ROW(A197)-3,1))","v":"Tektamer 38 Biocide"}]
[{"$f":"IF(INDEX(RawMaterialTable!$A$4:$A$223,ROW(A198)-3,1)=\"\",\"\",INDEX(RawMaterialTable!$A$4:$A$223,ROW(A198)-3,1))","v":"Tennessee #1 Ball"}]
[{"$f":"IF(INDEX(RawMaterialTable!$A$4:$A$223,ROW(A199)-3,1)=\"\",\"\",INDEX(RawMaterialTable!$A$4:$A$223,ROW(A199)-3,1))","v":"Tennessee #5 Ball"}]
[{"$f":"IF(INDEX(RawMaterialTable!$A$4:$A$223,ROW(A200)-3,1)=\"\",\"\",INDEX(RawMaterialTable!$A$4:$A$223,ROW(A200)-3,1))","v":"Tennessee #10 Ball"}]
[{"$f":"IF(INDEX(RawMaterialTable!$A$4:$A$223,ROW(A201)-3,1)=\"\",\"\",INDEX(RawMaterialTable!$A$4:$A$223,ROW(A201)-3,1))","v":"Tile #6 Kaolin"}]
[{"$f":"IF(INDEX(RawMaterialTable!$A$4:$A$223,ROW(A202)-3,1)=\"\",\"\",INDEX(RawMaterialTable!$A$4:$A$223,ROW(A202)-3,1))","v":"Tin Oxide"}]
[{"$f":"IF(INDEX(RawMaterialTable!$A$4:$A$223,ROW(A203)-3,1)=\"\",\"\",INDEX(RawMaterialTable!$A$4:$A$223,ROW(A203)-3,1))","v":"Titanium Dioxide"}]
[{"$f":"IF(INDEX(RawMaterialTable!$A$4:$A$223,ROW(A204)-3,1)=\"\",\"\",INDEX(RawMaterialTable!$A$4:$A$223,ROW(A204)-3,1))","v":"Turkish Colemanite"}]
[{"$f":"IF(INDEX(RawMaterialTable!$A$4:$A$223,ROW(A205)-3,1)=\"\",\"\",INDEX(RawMaterialTable!$A$4:$A$223,ROW(A205)-3,1))","v":"Turkish Ulexite"}]
[{"$f":"IF(INDEX(RawMaterialTable!$A$4:$A$223,ROW(A206)-3,1)=\"\",\"\",INDEX(RawMaterialTable!$A$4:$A$223,ROW(A206)-3,1))","v":"Ultrox"}]
[{"$f":"IF(INDEX(RawMaterialTable!$A$4:$A$223,ROW(A207)-3,1)=\"\",\"\",INDEX(RawMaterialTable!$A$4:$A$223,ROW(A207)-3,1))","v":"Veegum T"}]
[{"$f":"IF(INDEX(RawMaterialTable!$A$4:$A$223,ROW(A208)-3,1)=\"\",\"\",INDEX(RawMaterialTable!$A$4:$A$223,ROW(A208)-3,1))","v":"Velvacast Kaolin"}]
[{"$f":"IF(INDEX(RawMaterialTable!$A$4:$A$223,ROW(A209)-3,1)=\"\",\"\",INDEX(RawMaterialTable!$A$4:$A$223,ROW(A209)-3,1))","v":"vol353cer Hectorite"}]
[{"$f":"IF(INDEX(RawMaterialTable!$A$4:$A$223,ROW(A210)-3,1)=\"\",\"\",INDEX(RawMaterialTable!$A$4:$A$223,ROW(A210)-3,1))","v":"Volcanic Ash"}]
[{"$f":"IF(INDEX(RawMaterialTable!$A$4:$A$223,ROW(A211)-3,1)=\"\",\"\",INDEX(RawMaterialTable!$A$4:$A$223,ROW(A211)-3,1))","v":"Whiting, #10"}]
[{"$f":"IF(INDEX(RawMaterialTable!$A$4:$A$223,ROW(A212)-3,1)=\"\",\"\",INDEX(RawMaterialTable!$A$4:$A$223,ROW(A212)-3,1))","v":"Whiting"}]
[{"$f":"IF(INDEX(RawMaterialTable!$A$4:$A$223,ROW(A213)-3,1)=\"\",\"\",INDEX(RawMaterialTable!$A$4:$A$223,ROW(A213)-3,1))","v":"Wollastonite"}]
[{"$f":"IF(INDEX(RawMaterialTable!$A$4:$A$223,ROW(A214)-3,1)=\"\",\"\",INDEX(RawMaterialTable!$A$4:$A$223,ROW(A214)-3,1))","v":"Wollastonite Vansil"}]
[{"$f":"IF(INDEX(RawMaterialTable!$A$4:$A$223,ROW(A215)-3,1)=\"\",\"\",INDEX(RawMaterialTable!$A$4:$A$223,ROW(A215)-3,1))","v":"wood, pine"}]
[{"$f":"IF(INDEX(RawMaterialTable!$A$4:$A$223,ROW(A216)-3,1)=\"\",\"\",INDEX(RawMaterialTable!$A$4:$A$223,ROW(A216)-3,1))","v":"Yellow Ochre"}]
[{"$f":"IF(INDEX(RawMaterialTable!$A$4:$A$223,ROW(A217)-3,1)=\"\",\"\",INDEX(RawMaterialTable!$A$4:$A$223,ROW(A217)-3,1))","v":"Zinc Oxide"}]
[{"$f":"IF(INDEX(RawMaterialTable!$A$4:$A$223,ROW(A218)-3,1)=\"\",\"\",INDEX(RawMaterialTable!$A$4:$A$223,ROW(A218)-3,1))","v":"Zircopax"}]
[{"$f":"IF(INDEX(RawMaterialTable!$A$4:$A$223,ROW(A219)-3,1)=\"\",\"\",INDEX(RawMaterialTable!$A$4:$A$223,ROW(A219)-3,1))","v":"Zirconium Oxide"}]
[{"$f":"IF(INDEX(RawMaterialTable!$A$4:$A$223,ROW(A220)-3,1)=\"\",\"\",INDEX(RawMaterialTable!$A$4:$A$223,ROW(A220)-3,1))","v":""}]
[{"$f":"IF(INDEX(RawMaterialTable!$A$4:$A$223,ROW(A221)-3,1)=\"\",\"\",INDEX(RawMaterialTable!$A$4:$A$223,ROW(A221)-3,1))","v":""}]
[{"$f":"IF(INDEX(RawMaterialTable!$A$4:$A$223,ROW(A222)-3,1)=\"\",\"\",INDEX(RawMaterialTable!$A$4:$A$223,ROW(A222)-3,1))","v":""}]
[{"$f":"IF(INDEX(RawMaterialTable!$A$4:$A$223,ROW(A223)-3,1)=\"\",\"\",INDEX(RawMaterialTable!$A$4:$A$223,ROW(A223)-3,1))","v":""}]
[{"$f":"IF(INDEX(RawMaterialTable!$A$4:$A$223,ROW(A224)-3,1)=\"\",\"\",INDEX(RawMaterialTable!$A$4:$A$223,ROW(A224)-3,1))","v":{"$error":"#REF!"}}]
[{"$f":"IF(INDEX(RawMaterialTable!$A$4:$A$223,ROW(A225)-3,1)=\"\",\"\",INDEX(RawMaterialTable!$A$4:$A$223,ROW(A225)-3,1))","v":{"$error":"#REF!"}}]
[{"$f":"IF(INDEX(RawMaterialTable!$A$4:$A$223,ROW(A226)-3,1)=\"\",\"\",INDEX(RawMaterialTable!$A$4:$A$223,ROW(A226)-3,1))","v":{"$error":"#REF!"}}]
[{"$f":"IF(INDEX(RawMaterialTable!$A$4:$A$223,ROW(A227)-3,1)=\"\",\"\",INDEX(RawMaterialTable!$A$4:$A$223,ROW(A227)-3,1))","v":{"$error":"#REF!"}}]
[{"$f":"IF(INDEX(RawMaterialTable!$A$4:$A$223,ROW(A228)-3,1)=\"\",\"\",INDEX(RawMaterialTable!$A$4:$A$223,ROW(A228)-3,1))","v":{"$error":"#REF!"}}]
[{"$f":"IF(INDEX(RawMaterialTable!$A$4:$A$223,ROW(A229)-3,1)=\"\",\"\",INDEX(RawMaterialTable!$A$4:$A$223,ROW(A229)-3,1))","v":{"$error":"#REF!"}}]
[{"$f":"IF(INDEX(RawMaterialTable!$A$4:$A$223,ROW(A230)-3,1)=\"\",\"\",INDEX(RawMaterialTable!$A$4:$A$223,ROW(A230)-3,1))","v":{"$error":"#REF!"}}]
[{"$f":"IF(INDEX(RawMaterialTable!$A$4:$A$223,ROW(A231)-3,1)=\"\",\"\",INDEX(RawMaterialTable!$A$4:$A$223,ROW(A231)-3,1))","v":{"$error":"#REF!"}}]
[{"$f":"IF(INDEX(RawMaterialTable!$A$4:$A$223,ROW(A232)-3,1)=\"\",\"\",INDEX(RawMaterialTable!$A$4:$A$223,ROW(A232)-3,1))","v":{"$error":"#REF!"}}]
[{"$f":"IF(INDEX(RawMaterialTable!$A$4:$A$223,ROW(A233)-3,1)=\"\",\"\",INDEX(RawMaterialTable!$A$4:$A$223,ROW(A233)-3,1))","v":{"$error":"#REF!"}}]
[{"$f":"IF(INDEX(RawMaterialTable!$A$4:$A$223,ROW(A234)-3,1)=\"\",\"\",INDEX(RawMaterialTable!$A$4:$A$223,ROW(A234)-3,1))","v":{"$error":"#REF!"}}]
[{"$f":"IF(INDEX(RawMaterialTable!$A$4:$A$223,ROW(A235)-3,1)=\"\",\"\",INDEX(RawMaterialTable!$A$4:$A$223,ROW(A235)-3,1))","v":{"$error":"#REF!"}}]
[{"$f":"IF(INDEX(RawMaterialTable!$A$4:$A$223,ROW(A236)-3,1)=\"\",\"\",INDEX(RawMaterialTable!$A$4:$A$223,ROW(A236)-3,1))","v":{"$error":"#REF!"}}]
[{"$f":"IF(INDEX(RawMaterialTable!$A$4:$A$223,ROW(A237)-3,1)=\"\",\"\",INDEX(RawMaterialTable!$A$4:$A$223,ROW(A237)-3,1))","v":{"$error":"#REF!"}}]
[{"$f":"IF(INDEX(RawMaterialTable!$A$4:$A$223,ROW(A238)-3,1)=\"\",\"\",INDEX(RawMaterialTable!$A$4:$A$223,ROW(A238)-3,1))","v":{"$error":"#REF!"}}]
[{"$f":"IF(INDEX(RawMaterialTable!$A$4:$A$223,ROW(A239)-3,1)=\"\",\"\",INDEX(RawMaterialTable!$A$4:$A$223,ROW(A239)-3,1))","v":{"$error":"#REF!"}}]
[{"$f":"IF(INDEX(RawMaterialTable!$A$4:$A$223,ROW(A240)-3,1)=\"\",\"\",INDEX(RawMaterialTable!$A$4:$A$223,ROW(A240)-3,1))","v":{"$error":"#REF!"}}]
[{"$f":"IF(INDEX(RawMaterialTable!$A$4:$A$223,ROW(A241)-3,1)=\"\",\"\",INDEX(RawMaterialTable!$A$4:$A$223,ROW(A241)-3,1))","v":{"$error":"#REF!"}}]
[{"$f":"IF(INDEX(RawMaterialTable!$A$4:$A$223,ROW(A242)-3,1)=\"\",\"\",INDEX(RawMaterialTable!$A$4:$A$223,ROW(A242)-3,1))","v":{"$error":"#REF!"}}]
[{"$f":"IF(INDEX(RawMaterialTable!$A$4:$A$223,ROW(A243)-3,1)=\"\",\"\",INDEX(RawMaterialTable!$A$4:$A$223,ROW(A243)-3,1))","v":{"$error":"#REF!"}}]
[{"$f":"IF(INDEX(RawMaterialTable!$A$4:$A$223,ROW(A244)-3,1)=\"\",\"\",INDEX(RawMaterialTable!$A$4:$A$223,ROW(A244)-3,1))","v":{"$error":"#REF!"}}]
[{"$f":"IF(INDEX(RawMaterialTable!$A$4:$A$223,ROW(A245)-3,1)=\"\",\"\",INDEX(RawMaterialTable!$A$4:$A$223,ROW(A245)-3,1))","v":{"$error":"#REF!"}}]
[{"$f":"IF(INDEX(RawMaterialTable!$A$4:$A$223,ROW(A246)-3,1)=\"\",\"\",INDEX(RawMaterialTable!$A$4:$A$223,ROW(A246)-3,1))","v":{"$error":"#REF!"}}]
[{"$f":"IF(INDEX(RawMaterialTable!$A$4:$A$223,ROW(A247)-3,1)=\"\",\"\",INDEX(RawMaterialTable!$A$4:$A$223,ROW(A247)-3,1))","v":{"$error":"#REF!"}}]
[{"$f":"IF(INDEX(RawMaterialTable!$A$4:$A$223,ROW(A248)-3,1)=\"\",\"\",INDEX(RawMaterialTable!$A$4:$A$223,ROW(A248)-3,1))","v":{"$error":"#REF!"}}]
[{"$f":"IF(INDEX(RawMaterialTable!$A$4:$A$223,ROW(A249)-3,1)=\"\",\"\",INDEX(RawMaterialTable!$A$4:$A$223,ROW(A249)-3,1))","v":{"$error":"#REF!"}}]
[{"$f":"IF(INDEX(RawMaterialTable!$A$4:$A$223,ROW(A250)-3,1)=\"\",\"\",INDEX(RawMaterialTable!$A$4:$A$223,ROW(A250)-3,1))","v":{"$error":"#REF!"}}]
[{"$f":"IF(INDEX(RawMaterialTable!$A$4:$A$223,ROW(A251)-3,1)=\"\",\"\",INDEX(RawMaterialTable!$A$4:$A$223,ROW(A251)-3,1))","v":{"$error":"#REF!"}}]
[{"$f":"IF(INDEX(RawMaterialTable!$A$4:$A$256,ROW(A252)-4,1)=\"\",\"\",INDEX(RawMaterialTable!$A$4:$A$256,ROW(A252)-4,1))","v":""}]
[{"$f":"IF(INDEX(RawMaterialTable!$A$4:$A$256,ROW(A253)-4,1)=\"\",\"\",INDEX(RawMaterialTable!$A$4:$A$256,ROW(A253)-4,1))","v":""}]
[{"$f":"IF(INDEX(RawMaterialTable!$A$4:$A$256,ROW(A254)-4,1)=\"\",\"\",INDEX(RawMaterialTable!$A$4:$A$256,ROW(A254)-4,1))","v":""}]
[{"$f":"IF(INDEX(RawMaterialTable!$A$4:$A$256,ROW(A255)-4,1)=\"\",\"\",INDEX(RawMaterialTable!$A$4:$A$256,ROW(A255)-4,1))","v":""}]
[{"$f":"IF(INDEX(RawMaterialTable!$A$4:$A$256,ROW(A256)-4,1)=\"\",\"\",INDEX(RawMaterialTable!$A$4:$A$256,ROW(A256)-4,1))","v":""}]
[{"$f":"IF(INDEX(RawMaterialTable!$A$4:$A$256,ROW(A257)-4,1)=\"\",\"\",INDEX(RawMaterialTable!$A$4:$A$256,ROW(A257)-4,1))","v":""}]
[{"$f":"IF(RawMaterialTable!$A264=\"\",\"\",RawMaterialTable!$A264)","v":""}]
[{"$f":"IF(RawMaterialTable!$A265=\"\",\"\",RawMaterialTable!$A265)","v":""}]
[{"$f":"IF(RawMaterialTable!$A266=\"\",\"\",RawMaterialTable!$A266)","v":""}]
[{"$f":"IF(RawMaterialTable!$A267=\"\",\"\",RawMaterialTable!$A267)","v":""}]
[{"$f":"IF(RawMaterialTable!$A268=\"\",\"\",RawMaterialTable!$A268)","v":""}]
[{"$f":"IF(RawMaterialTable!$A269=\"\",\"\",RawMaterialTable!$A269)","v":""}]
[{"$f":"IF(RawMaterialTable!$A270=\"\",\"\",RawMaterialTable!$A270)","v":""}]
[{"$f":"IF(RawMaterialTable!$A271=\"\",\"\",RawMaterialTable!$A271)","v":""}]
[{"$f":"IF(RawMaterialTable!$A272=\"\",\"\",RawMaterialTable!$A272)","v":""}]
[{"$f":"IF(RawMaterialTable!$A273=\"\",\"\",RawMaterialTable!$A273)","v":""}]
[{"$f":"IF(RawMaterialTable!$A274=\"\",\"\",RawMaterialTable!$A274)","v":""}]
[{"$f":"IF(RawMaterialTable!$A275=\"\",\"\",RawMaterialTable!$A275)","v":""}]
[{"$f":"IF(RawMaterialTable!$A276=\"\",\"\",RawMaterialTable!$A276)","v":""}]
[{"$f":"IF(RawMaterialTable!$A277=\"\",\"\",RawMaterialTable!$A277)","v":""}]
[{"$f":"IF(RawMaterialTable!$A278=\"\",\"\",RawMaterialTable!$A278)","v":""}]
[{"$f":"IF(RawMaterialTable!$A279=\"\",\"\",RawMaterialTable!$A279)","v":""}]
[{"$f":"IF(RawMaterialTable!$A280=\"\",\"\",RawMaterialTable!$A280)","v":""}]
[{"$f":"IF(RawMaterialTable!$A281=\"\",\"\",RawMaterialTable!$A281)","v":""}]
[{"$f":"IF(RawMaterialTable!$A282=\"\",\"\",RawMaterialTable!$A282)","v":""}]
[{"$f":"IF(RawMaterialTable!$A283=\"\",\"\",RawMaterialTable!$A283)","v":""}]
[{"$f":"IF(RawMaterialTable!$A284=\"\",\"\",RawMaterialTable!$A284)","v":""}]
[{"$f":"IF(RawMaterialTable!$A285=\"\",\"\",RawMaterialTable!$A285)","v":""}]
[{"$f":"IF(RawMaterialTable!$A286=\"\",\"\",RawMaterialTable!$A286)","v":""}]
[{"$f":"IF(RawMaterialTable!$A287=\"\",\"\",RawMaterialTable!$A287)","v":""}]
[{"$f":"IF(RawMaterialTable!$A288=\"\",\"\",RawMaterialTable!$A288)","v":""}]
[{"$f":"IF(RawMaterialTable!$A289=\"\",\"\",RawMaterialTable!$A289)","v":""}]
[{"$f":"IF(RawMaterialTable!$A290=\"\",\"\",RawMaterialTable!$A290)","v":""}]
[{"$f":"IF(RawMaterialTable!$A291=\"\",\"\",RawMaterialTable!$A291)","v":""}]
[{"$f":"IF(RawMaterialTable!$A292=\"\",\"\",RawMaterialTable!$A292)","v":""}]
[{"$f":"IF(RawMaterialTable!$A293=\"\",\"\",RawMaterialTable!$A293)","v":""}]
[{"$f":"IF(RawMaterialTable!$A294=\"\",\"\",RawMaterialTable!$A294)","v":""}]
[{"$f":"IF(RawMaterialTable!$A295=\"\",\"\",RawMaterialTable!$A295)","v":""}]
[{"$f":"IF(RawMaterialTable!$A296=\"\",\"\",RawMaterialTable!$A296)","v":""}]
[{"$f":"IF(RawMaterialTable!$A297=\"\",\"\",RawMaterialTable!$A297)","v":""}]
[{"$f":"IF(RawMaterialTable!$A298=\"\",\"\",RawMaterialTable!$A298)","v":""}]
[{"$f":"IF(RawMaterialTable!$A299=\"\",\"\",RawMaterialTable!$A299)","v":""}]
[{"$f":"IF(RawMaterialTable!$A300=\"\",\"\",RawMaterialTable!$A300)","v":""}]
[{"$f":"IF(RawMaterialTable!$A301=\"\",\"\",RawMaterialTable!$A301)","v":""}]
[{"$f":"IF(RawMaterialTable!$A302=\"\",\"\",RawMaterialTable!$A302)","v":""}]
[{"$f":"IF(RawMaterialTable!$A303=\"\",\"\",RawMaterialTable!$A303)","v":""}]
[{"$f":"IF(RawMaterialTable!$A304=\"\",\"\",RawMaterialTable!$A304)","v":""}]
[{"$f":"IF(RawMaterialTable!$A305=\"\",\"\",RawMaterialTable!$A305)","v":""}]
[{"$f":"IF(RawMaterialTable!$A306=\"\",\"\",RawMaterialTable!$A306)","v":""}]
[{"$f":"IF(RawMaterialTable!$A307=\"\",\"\",RawMaterialTable!$A307)","v":""}]
[{"$f":"IF(RawMaterialTable!$A308=\"\",\"\",RawMaterialTable!$A308)","v":""}]
[{"$f":"IF(RawMaterialTable!$A309=\"\",\"\",RawMaterialTable!$A309)","v":""}]
[{"$f":"IF(RawMaterialTable!$A310=\"\",\"\",RawMaterialTable!$A310)","v":""}]
[{"$f":"IF(RawMaterialTable!$A311=\"\",\"\",RawMaterialTable!$A311)","v":""}]
[{"$f":"IF(RawMaterialTable!$A312=\"\",\"\",RawMaterialTable!$A312)","v":""}]
[{"$f":"IF(RawMaterialTable!$A313=\"\",\"\",RawMaterialTable!$A313)","v":""}]
[{"$f":"IF(RawMaterialTable!$A314=\"\",\"\",RawMaterialTable!$A314)","v":""}]
[{"$f":"IF(RawMaterialTable!$A315=\"\",\"\",RawMaterialTable!$A315)","v":""}]
[{"$f":"IF(RawMaterialTable!$A316=\"\",\"\",RawMaterialTable!$A316)","v":""}]
[{"$f":"IF(RawMaterialTable!$A317=\"\",\"\",RawMaterialTable!$A317)","v":""}]
[{"$f":"IF(RawMaterialTable!$A318=\"\",\"\",RawMaterialTable!$A318)","v":""}]
[{"$f":"IF(RawMaterialTable!$A319=\"\",\"\",RawMaterialTable!$A319)","v":""}]
[{"$f":"IF(RawMaterialTable!$A320=\"\",\"\",RawMaterialTable!$A320)","v":""}]
[{"$f":"IF(RawMaterialTable!$A321=\"\",\"\",RawMaterialTable!$A321)","v":""}]
[{"$f":"IF(RawMaterialTable!$A322=\"\",\"\",RawMaterialTable!$A322)","v":""}]
[{"$f":"IF(RawMaterialTable!$A323=\"\",\"\",RawMaterialTable!$A323)","v":""}]
[{"$f":"IF(RawMaterialTable!$A324=\"\",\"\",RawMaterialTable!$A324)","v":""}]
[{"$f":"IF(RawMaterialTable!$A325=\"\",\"\",RawMaterialTable!$A325)","v":""}]
[{"$f":"IF(RawMaterialTable!$A326=\"\",\"\",RawMaterialTable!$A326)","v":""}]
[{"$f":"IF(RawMaterialTable!$A327=\"\",\"\",RawMaterialTable!$A327)","v":""}]
[{"$f":"IF(RawMaterialTable!$A328=\"\",\"\",RawMaterialTable!$A328)","v":""}]
[{"$f":"IF(RawMaterialTable!$A329=\"\",\"\",RawMaterialTable!$A329)","v":""}]
[{"$f":"IF(RawMaterialTable!$A330=\"\",\"\",RawMaterialTable!$A330)","v":""}]
[{"$f":"IF(RawMaterialTable!$A331=\"\",\"\",RawMaterialTable!$A331)","v":""}]
[{"$f":"IF(RawMaterialTable!$A332=\"\",\"\",RawMaterialTable!$A332)","v":""}]
[{"$f":"IF(RawMaterialTable!$A333=\"\",\"\",RawMaterialTable!$A333)","v":""}]
[{"$f":"IF(RawMaterialTable!$A334=\"\",\"\",RawMaterialTable!$A334)","v":""}]
[{"$f":"IF(RawMaterialTable!$A335=\"\",\"\",RawMaterialTable!$A335)","v":""}]
[{"$f":"IF(RawMaterialTable!$A336=\"\",\"\",RawMaterialTable!$A336)","v":""}]
[{"$f":"IF(RawMaterialTable!$A337=\"\",\"\",RawMaterialTable!$A337)","v":""}]
[{"$f":"IF(RawMaterialTable!$A338=\"\",\"\",RawMaterialTable!$A338)","v":""}]
[{"$f":"IF(RawMaterialTable!$A339=\"\",\"\",RawMaterialTable!$A339)","v":""}]
[{"$f":"IF(RawMaterialTable!$A340=\"\",\"\",RawMaterialTable!$A340)","v":""}]
[{"$f":"IF(RawMaterialTable!$A341=\"\",\"\",RawMaterialTable!$A341)","v":""}]
[{"$f":"IF(RawMaterialTable!$A342=\"\",\"\",RawMaterialTable!$A342)","v":""}]
[{"$f":"IF(RawMaterialTable!$A343=\"\",\"\",RawMaterialTable!$A343)","v":""}]
[{"$f":"IF(RawMaterialTable!$A344=\"\",\"\",RawMaterialTable!$A344)","v":""}]
[{"$f":"IF(RawMaterialTable!$A345=\"\",\"\",RawMaterialTable!$A345)","v":""}]
[{"$f":"IF(RawMaterialTable!$A346=\"\",\"\",RawMaterialTable!$A346)","v":""}]
[{"$f":"IF(RawMaterialTable!$A347=\"\",\"\",RawMaterialTable!$A347)","v":""}]
[{"$f":"IF(RawMaterialTable!$A348=\"\",\"\",RawMaterialTable!$A348)","v":""}]
[{"$f":"IF(RawMaterialTable!$A349=\"\",\"\",RawMaterialTable!$A349)","v":""}]
[{"$f":"IF(RawMaterialTable!$A350=\"\",\"\",RawMaterialTable!$A350)","v":""}]
[{"$f":"IF(RawMaterialTable!$A351=\"\",\"\",RawMaterialTable!$A351)","v":""}]
[{"$f":"IF(RawMaterialTable!$A352=\"\",\"\",RawMaterialTable!$A352)","v":""}]
[{"$f":"IF(RawMaterialTable!$A353=\"\",\"\",RawMaterialTable!$A353)","v":""}]
[{"$f":"IF(RawMaterialTable!$A354=\"\",\"\",RawMaterialTable!$A354)","v":""}]
[{"$f":"IF(RawMaterialTable!$A355=\"\",\"\",RawMaterialTable!$A355)","v":""}]
[{"$f":"IF(RawMaterialTable!$A356=\"\",\"\",RawMaterialTable!$A356)","v":""}]
[{"$f":"IF(RawMaterialTable!$A357=\"\",\"\",RawMaterialTable!$A357)","v":""}]
[{"$f":"IF(RawMaterialTable!$A358=\"\",\"\",RawMaterialTable!$A358)","v":""}]
[{"$f":"IF(RawMaterialTable!$A359=\"\",\"\",RawMaterialTable!$A359)","v":""}]
[{"$f":"IF(RawMaterialTable!$A360=\"\",\"\",RawMaterialTable!$A360)","v":""}]
[{"$f":"IF(RawMaterialTable!$A361=\"\",\"\",RawMaterialTable!$A361)","v":""}]

{"sheet":"RawMaterialTable","index":5,"n_rows":226,"n_cols":33,"rows_kept":226,"cut":false,"hidden":true,"merged":[]}
["Materials","%LOI","Cost\\Oxide","BaO","CaO","PbO","Li2O","MgO","K2O","Na2O","SrO","ZnO","SnO2","TiO2","ZrO2","Al2O3","B2O3","P2O5","SiO2","Fe2O3","Cr2O3","CuO","CoO","MnO","NiO","Available",null,null,"Price/Lb","Density Eff",null,"Density","Source"]
[null,null,"mole Wt",{"$f":"Constants!F9","v":153.33000000000001},{"$f":"Constants!F10","v":56.08},{"$f":"Constants!F23","v":223.2},{"$f":"Constants!F17","v":29.881999999999998},{"$f":"Constants!F18","v":40.31},{"$f":"Constants!F16","v":94.2},{"$f":"Constants!F20","v":61.98},{"$f":"Constants!F26","v":103.62},{"$f":"Constants!F28","v":81.39},{"$f":"Constants!F25","v":150.70999999999998},{"$f":"Constants!F27","v":79.87},{"$f":"Constants!F29","v":123.22},{"$f":"Constants!F7","v":101.96000000000001},{"$f":"Constants!F8","v":69.618200000000002},{"$f":"Constants!F22","v":141.94},{"$f":"Constants!F24","v":60.09},{"$f":"Constants!F14","v":159.68},{"$f":"Constants!F12","v":152},{"$f":"Constants!F13","v":79.539999999999992},{"$f":"Constants!F11","v":74.930000000000007},{"$f":"Constants!F19","v":70.94},{"$f":"Constants!F21","v":74.69},0,"<--Weight",null,null,2.5]
[4,null,"oxide COE",{"$f":"VLOOKUP(D1, CoTE, $A3)","v":7.166666666666667},7.2888888888888896,8.3000000000000007,6.8000000000000007,6.0000000000000009,33.1,38.700000000000003,7.4555555555555557,9.4,3.65,3.9666666666666668,2,3.0000000000000004,3.1,7.1400000000000006,0.30555555555555552,5.7833333333333323,6.3333333333333339,3.5000000000000004,5.5555555555555562,5,5,0,"<--Expansion","Totality"]
["Alumina Calcined",null,{"$f":"IF(AC4<>\"\",AC4*2.2,0)","v":3.19},null,null,null,null,null,null,null,null,null,null,null,null,100,null,null,null,null,null,null,null,null,null,null,null,{"$f":"SUM(D4:Z4)+B4","v":100},1.45,{"$f":"IF(AF4=\"\",AD$2,AF4)","v":3.9870000000000001},null,3.9870000000000001]
["Alumina Hydrate",34.6,3.3000000000000003,null,null,null,null,null,null,null,null,null,null,null,null,65.38,null,null,null,null,null,null,null,null,null,null,null,{"$f":"SUM(D5:Z5)+B5","v":99.97999999999999},1.5,2.42,null,2.42]
["A-3 Feldspar",0.08,{"$f":"IF(AC6<>\"\",AC6*2.2,0)","v":0},null,0.4,null,null,null,7.5,4,null,null,null,null,null,16.3,null,null,71.63,7.0000000000000007E-2,null,null,null,null,null,null,null,99.97999999999999,null,2.56,null,2.56]
["AJAX Glomax Kaolin",0.378,{"$f":"IF(AC7<>\"\",AC7*2.2,0)","v":0},null,null,null,null,null,0.4,0.3,null,null,null,0.93,null,44.4,null,null,53.16,0.42,null,null,null,null,null,null,null,99.988,null,{"$f":"IF(AF7=\"\",AD$2,AF7)","v":2.42},null,{"$f":"AVERAGE(2.16,2.68)","v":2.42}]
["AJAX P Kaolin",13.4,0,null,0.25,null,null,0.3,0.04,null,null,null,null,1.9710000000000001,null,38.1,null,null,45.4,0.48,null,null,null,null,null,null,null,99.941000000000017,null,{"$f":"IF(AF8=\"\",AD$2,AF8)","v":2.35},null,2.35]
["Albany Slip",9.4,0,null,5.8,null,null,2.7,3.2,0.8,null,null,null,0.4,null,14.6,null,null,57.8,5.2,null,null,null,null,null,null,null,99.9,null,2.6,null,2.6]
["Alberta Slip",9.3000000000000007,5.3900000000000006,null,6.5,null,null,3.1,3,2.2000000000000002,null,null,null,0.4,null,13.8,null,0.1,56.8,4.8,null,null,null,null,null,null,null,100,2.4500000000000002,2.6,null,2.6]
["Alberta Slip II",8,0,null,6,null,null,2.6,2.2999999999999998,1.8,null,null,null,0.4,null,12.5,null,0.1,61,5.2,null,null,null,null,null,null,null,99.9,null,2.6,null,2.6]
["Anhydrous Borax",null,2.75,null,null,null,null,null,null,30.8,null,null,null,null,null,null,69.180000000000007,null,null,null,null,null,null,null,null,null,null,99.98,1.25,1.73,null,1.73]
["Ash, Oak",6.71,0,null,21.51,null,null,15.85,33.44,2.2999999999999998,null,null,null,null,null,null,null,null,0.67,0.57999999999999996,null,null,null,2.6,null,null,null,83.659999999999982,null,1.5,null,1.5]
["Ash, Hardwood",6.71,0,null,21.51,null,null,15.85,33.44,2.2999999999999998,null,null,null,null,null,null,null,null,0.67,0.57999999999999996,null,null,null,2.6,null,null,null,83.659999999999982,0,1.5,null,1.5]
["Ash, Pine",29.69,0,null,41.1,null,null,8.2100000000000009,10.96,0.77,null,null,null,null,null,null,null,null,2,7.0000000000000007E-2,null,null,null,2.54,null,null,null,95.34,0,1.5,null,1.5]
["Ash, softwood",29.69,0,null,41.1,null,null,8.2100000000000009,10.96,0.77,null,null,null,null,null,null,null,null,2,7.0000000000000007E-2,null,null,null,2.54,null,null,null,95.34,0,1.5,null,1.5]
["BALL CLAY",12.2,0.55000000000000004,null,0.19,null,null,0.2,0.9,0.4,null,null,null,1.5,null,31.7,null,null,52,0.8,null,null,null,null,null,null,null,99.89,{"$f":"AC138","v":0.25},2.6,null,2.6]
["Baking Soda",63.170999999999999,0,null,null,null,null,null,null,36.829000000000001,null,null,null,null,null,null,null,null,null,null,null,null,null,null,null,null,null,100,null,2.2000000000000002,null,2.2000000000000002]
["Barium Carbonate",22.34,6.6000000000000005,77.66,null,null,null,null,null,null,null,null,null,null,null,null,null,null,null,null,null,null,null,null,null,null,null,100,3,4.2859999999999996,null,4.2859999999999996]
["Barnard Clay",8.31,2.9700000000000006,null,0.6,null,null,0.7,1.1000000000000001,0.6,null,null,null,0.2,null,7.6,null,null,47,33.9,null,null,null,null,null,null,null,100.00999999999999,1.35,2.6,null,2.6]
["Bell Dark Ball Clay",10.451000000000001,0,null,0.19,null,null,0.19,0.3,0.1,null,null,null,1.8,null,26.8,null,null,59.2,0.97,null,null,null,null,null,null,null,100.001,null,2.6,null,2.6]
["Bell Feldspar",0.214,0,null,0.39700000000000002,null,null,null,10.073,3.09,null,null,null,null,null,17.872,null,null,68.275000000000006,7.9000000000000001E-2,null,null,null,null,null,null,null,100,null,2.56,null,2.56]
["Bentolite L",5.8,0,null,1.67,null,null,3.66,0.1,0.2,null,null,null,0.27,null,15.76,null,null,72.2,0.33,null,null,null,null,null,null,null,99.99,null,1.8,null,1.8]
["Bentonite",10,1.7600000000000002,null,1,null,null,2,1,3,null,null,null,null,null,20,null,null,59,3.5,null,null,null,null,null,null,null,99.5,0.8,1.8,null,1.8]
["Bone Ash",1.02,3.8500000000000005,null,55.25,null,null,1.4,null,null,null,null,null,null,null,null,null,41.65,null,null,null,null,null,null,null,null,null,99.32,{"$f":"1.75","v":1.75},2.31,null,2.31]
["Borax",47.26,2.75,null,null,null,null,null,null,16.25,null,null,null,null,null,null,36.49,null,null,null,null,null,null,null,null,null,null,100,1.25,1.73,null,1.73]
["Borax 5 Mol",29.7,0,null,null,null,null,null,null,16.25,null,null,null,null,null,null,48.5,null,null,null,null,null,null,null,null,null,null,94.45,null,1.73,null,1.73]
["Boric Acid",43.5,0,null,null,null,null,null,null,null,null,null,null,null,null,null,56.5,null,null,null,null,null,null,null,null,null,null,100,null,1.4350000000000001,null,1.4350000000000001,"Optibor TG - http://www.borax.com/pdfs/CSF.Final.pdf"]
["Buckingham Feldspar",0.22,0,null,0.2,null,null,0.1,11.6,3,null,null,null,null,null,18,null,null,66.900000000000006,null,null,null,null,null,null,null,null,100.02000000000001,null,2.56,null,2.56]
["Boraq 1",25.3,0,null,21.8,null,null,2.2999999999999998,0.6,3.6,null,null,null,null,null,2.8,30,null,13.2,0.2,null,null,null,null,null,null,null,99.800000000000011,null,2.42,null,2.42]
["Boraq 2",26.4,0,null,25.4,null,null,3.6,0.5,3.2,null,null,null,null,null,2.4,26.5,null,11.9,0.1,null,null,null,null,null,null,null,100,null,2.42,null,2.42]
["Boraq 3",26.05,0,null,27.3,null,null,2,0.5,3.2,null,null,null,null,null,2.4,26.5,null,11.9,0.1,null,null,null,null,null,null,null,99.949999999999989,null,2.42,null,2.42]
["Cadycal",24,0,null,32.31,null,null,0.6,null,0.184,null,null,null,null,null,0.43,40.26,null,2.21,null,null,null,null,null,null,null,null,99.993999999999986,null,2.42,null,{"$f":"AF116","v":2.42}]
["Calcined Kaolin",null,1.6500000000000001,null,0.2,null,null,0.2,0.2,0.2,null,null,null,1.5,null,43.5,null,null,54,0.2,null,null,null,null,null,null,null,100,0.75,2.41,null,2.41]
["Calcium Borate",null,0,null,44.6,null,null,null,null,null,null,null,null,null,null,null,55.37,null,null,null,null,null,null,null,null,null,null,99.97,null,1.73,null,1.73]
["Calcium Carbonate",43.9,0.52800000000000002,null,56.1,null,null,null,null,null,null,null,null,null,null,null,null,null,null,null,null,null,null,null,null,null,null,100,0.24,2.75,null,2.75]
["Calcium Feldspar",null,0,null,10.82,null,null,null,null,null,null,null,null,null,null,19.66,null,null,69.52,null,null,null,null,null,null,null,null,100,null,2.56,null,2.56]
["Calvert Clay",7.98,0,null,0.3,null,null,0.8,2,0.41,null,null,null,1.21,null,23.8,null,null,57.79,5.71,null,null,null,null,null,null,null,100,null,2.6,null,2.6]
["Cedar Heights Fire",8.1300000000000008,0,null,0.56999999999999995,null,null,0.11,null,0.5,null,null,null,0.31,null,22.06,null,null,66.62,1.7,null,null,null,null,null,null,null,100,null,2.6,null,2.6]
["Chesterfield Spar",0.28999999999999998,0,null,0.3,null,null,null,8.5,3.75,null,null,null,null,null,16.34,null,null,70.75,7.0000000000000007E-2,null,null,null,null,null,null,null,100,null,2.6,null,2.6]
["China Clay",12.5,1.1000000000000001,null,null,null,null,null,null,null,null,null,null,null,null,40.200000000000003,null,null,47.3,null,null,null,null,null,null,null,null,100,0.5,2.6,null,2.6]
["Chromium Oxide",null,20.900000000000002,null,null,null,null,null,null,null,null,null,null,null,null,null,null,null,null,null,100,null,null,null,null,null,null,100,9.5,5.22,null,5.22]
["CMC GUM",100,17.600000000000001,null,null,null,null,null,null,null,null,null,null,null,null,null,null,null,null,null,null,null,null,null,null,null,null,100,8,1,null,1]
["ABC Colemanite",25.5,0,null,29.6,null,null,0.3,null,0.1,1,null,null,null,null,0.2,42.6,null,0.6,0.1,null,null,null,null,null,null,null,100,null,2.42,null,2.42]
["Colemanite",22,0,null,27,null,null,1.5,null,null,null,null,null,null,null,0.5,43,null,4,0.3,null,null,null,null,null,null,null,98.3,null,2.42,null,2.42]
["Cobalt Carbonate",37,107.25000000000001,null,null,null,null,null,null,null,null,null,null,null,null,null,null,null,null,null,null,null,63,null,null,null,null,100,48.75,4.3099999999999996,null,4.3099999999999996]
["Cobalt Oxide",null,151.25,null,null,null,null,null,null,null,null,null,null,null,null,null,null,null,null,null,null,null,100,null,null,null,null,100,68.75,6.44,null,6.44]
["Copper Carbonate",35.6,17.600000000000001,null,null,null,null,null,null,null,null,null,null,null,null,null,null,null,null,null,null,64.400000000000006,null,null,null,null,null,100,8,4,null,4]
["Copper (I)Oxide - Red",null,31.900000000000002,null,null,null,null,null,null,null,null,null,null,null,null,null,null,null,null,null,null,111.175,null,null,null,null,null,111.175,14.5,6,null,6]
["Copper (II)Oxide - Black",null,20.900000000000002,null,null,null,null,null,null,null,null,null,null,null,null,null,null,null,null,null,null,100,null,null,null,null,null,100,9.5,6.3150000000000004,null,6.3150000000000004]
["Cornwall Stone",1.5,4.95,null,2,null,null,null,4,3.5,null,null,null,0.1,null,16.5,null,null,73,0.15,null,null,null,null,null,null,null,100.75,2.25,2.6,null,2.6]
["Cryolite",54.4,7.128000000000001,null,null,null,null,null,null,22.39,null,null,null,null,null,68.56,null,null,null,null,null,null,null,null,null,null,null,{"$f":"SUM(D52:Z52)+B52","v":145.35},3.24,2.95,null,2.95]
["Custer Feldspar",0.3,0.92400000000000004,null,0.3,null,null,null,10.08,3.02,null,null,null,null,null,17.13,null,null,69.02,0.15,null,null,null,null,null,null,null,100,0.42,2.66,null,2.66]
["Diamond Kaolin",13.5,0,null,0.15,null,null,0.1,0.18,0.08,null,null,null,1.4,null,37.9,null,null,45.6,0.7,null,null,null,null,null,null,null,99.61,null,2.6,null,2.6]
["Dolomite",47.61,0.44000000000000006,null,30.49,null,null,21.9,null,null,null,null,null,null,null,null,null,null,null,null,null,null,null,null,null,null,null,100,0.2,2.85,null,2.85]
["English Kaolin",12.16,0,null,0.02,null,null,0.28000000000000003,1.79,0.05,null,null,null,0.06,null,37.380000000000003,null,null,47.44,0.82,null,null,null,null,null,null,null,100,null,2.6,null,2.6]
["EPK Kaolin",13.91,0.77,null,0.18,null,null,9.8000000000000004E-2,0.33,5.8999999999999997E-2,null,null,null,0.37,null,37.36,null,0.23599999999999999,45.73,0.79,null,null,null,null,null,null,null,99.063000000000002,0.35,2.6,null,2.6,"Edgars Minerals, Inc. - http://www.edgarminerals.com/EPK-Clay.html"]
["Eureka Feldspar",0.2,0,null,0.01,null,null,null,9.3699999999999992,3.49,null,null,null,null,null,17.05,null,null,69.7,0.11,null,null,null,null,null,null,null,99.93,null,2.66,null,2.66]
["F-4 Feldspar",0.2,0.68200000000000005,null,1.5,null,null,0.05,5,6.8,null,null,null,null,null,19.600000000000001,null,null,68.849999999999994,0.05,null,null,null,null,null,null,null,102.05,0.31,2.66,null,2.66,"http://www.pedar.us/chemical_labels/FELDSPAR,%20KONA%20F-4.PDF"]
["Fireclay, Hawthorne Missouri",8,0.66,null,0.3,null,null,0.7,1.3,0.1,null,null,null,1.9,null,35.200000000000003,null,null,51,1.4,null,null,null,null,null,null,null,99.9,0.3,2.6,null,2.6]
["Fireclay, AP Green Missouri",11,0.66,null,0.35,null,null,0.35,0.5,0.5,null,null,null,2,null,31,null,null,52,2,null,null,null,null,null,null,null,99.7,0.3,2.6,null,2.6]
["Flint",{"$f":"B185","v":0.01},0.50600000000000012,0,8.0000000000000002E-3,0,0,{"$f":"H185","v":8.0000000000000002E-3},0.01,8.0000000000000002E-3,0,0,0,0.02,0,0.2,0,0,99.64,2.5999999999999999E-2,0,0,0,0,0,0,0,99.93,0.23,2.6480000000000001,null,2.6480000000000001,{"$f":"AG185","v":"SIL-CO-SIL 52 http://www.u-s-silica.com/PDS/Columbia/ColSCS522009.pdf"}]
["Fluorspar",46.4,5.5,null,50.6,null,null,null,null,null,null,null,null,null,null,null,null,null,3,null,null,null,null,null,null,null,null,100,2.5,3.18,null,3.18]
["FRIT 13",null,0,null,null,68.900000000000006,null,null,null,8.2100000000000009,null,null,null,null,null,null,11.98,null,10.87,null,null,null,null,null,null,null,null,99.960000000000022,null,2.6,null,2.6]
["FRIT 14",null,0,null,20,null,null,null,null,10.4,null,null,null,null,null,null,23.3,null,46.4,null,null,null,null,null,null,null,null,100.1,null,2.6,null,2.6]
["FRIT 22",null,0,null,6.8319999999999999,30.65,null,null,null,null,null,null,null,null,null,null,17.672000000000001,null,44.845999999999997,null,null,null,null,null,null,null,null,100,null,2.6,null,2.6]
["FRIT 240",null,0,null,null,59.27,null,null,null,6.4,null,null,null,null,null,null,14.38,null,19.95,null,null,null,null,null,null,null,null,100,null,2.6,null,2.6]
["FRIT 266",null,0,null,15.512,null,null,null,null,8.0679999999999996,null,null,null,null,null,13.273,31.132000000000001,null,32.015000000000001,null,null,null,null,null,null,null,null,100,null,2.6,null,2.6]
["FRIT 267",null,0,null,10.404,null,null,null,4.0549999999999997,6.3650000000000002,null,null,null,null,null,9.7959999999999994,28.58,null,40.799999999999997,null,null,null,null,null,null,null,null,100,null,2.6,null,2.6]
["FRIT 285",null,0,null,null,null,null,null,2.9849999999999999,17.684000000000001,null,null,null,null,null,6.7880000000000003,20.734000000000002,null,51.808,null,null,null,null,null,null,null,null,{"$f":"SUM(D70:Z70)+B70","v":99.998999999999995},null,2.6,null,2.6]
["FRIT 3110",null,{"$f":"IF(AC71<>\"\",AC71*2.2,0)","v":5.5},null,6.3,null,null,null,2.2999999999999998,15.3,null,null,null,null,null,3.7,2.6,null,69.8,null,null,null,null,null,null,null,null,100,2.5,2.6,null,2.6]
["FRIT 3124",null,4.4000000000000004,null,14.1,null,null,null,0.7,6.3,null,null,null,null,null,9.9,13.7,null,55.3,null,null,null,null,null,null,null,null,100,2,{"$f":"IF(AF72=\"\",AD$2,AF72)","v":2.6},null,2.6]
["FRIT 3134",null,4.29,null,20.100000000000001,null,null,null,null,10.3,null,null,null,null,null,null,23.1,null,46.5,null,null,null,null,null,null,null,null,100,1.95,2.6,null,2.6,"Digital Fire"]
["FRIT 316",null,0,null,null,61.3,null,null,null,null,null,null,null,null,null,7,null,null,31.69,null,null,null,null,null,null,null,null,99.99,null,2.6,null,2.6]
["FRIT 3195",null,4.4000000000000004,null,10.9,null,null,0.12,null,6.2,null,null,null,null,null,11.9,23.5,null,47.3,null,null,null,null,null,null,null,null,99.919999999999987,2,2.6,null,2.6]
["FRIT 3211",null,0,null,42,null,null,null,null,null,null,null,null,null,null,null,58,null,null,null,null,null,null,null,null,null,null,100,null,2.6,null,2.6]
["FRIT 3249",null,0,null,3.5,null,null,12.2,null,null,null,null,null,null,null,13.3,28.9,null,42.1,null,null,null,null,null,null,null,null,100,null,2.6,null,2.6]
["FRIT 3269",1.6,3.9600000000000004,null,0.1,null,null,null,8.1,11.1,null,1,null,null,null,13.2,15.2,null,49.7,null,null,null,null,null,null,null,null,100,1.8,2.6,null,2.6]
["FRIT 3278",null,0,null,6.9,null,null,null,null,15.3,null,null,null,null,null,null,21.6,null,56.2,null,null,null,null,null,null,null,null,100,null,2.6,null,2.6]
["FRIT 3289",null,3.9600000000000004,27.4,null,null,null,null,null,5.5,null,null,null,null,null,5.4,12.4,null,49.3,null,null,null,null,null,null,null,null,100,1.8,2.6,null,2.6]
["FRIT 3300",null,0,6.2,8.8000000000000007,22.2,null,0.4,3.2,0.7,null,10.5,null,null,null,9.1999999999999993,null,null,38.799999999999997,null,null,null,null,null,null,null,null,100,null,2.6,null,2.6]
["FRIT 3304",null,0,null,null,54.4,null,null,null,1.1000000000000001,null,null,null,null,null,4,null,null,40.5,null,null,null,null,null,null,null,null,100,null,2.6,null,2.6]
["FRIT 3327",null,0,null,null,85,null,null,null,null,null,null,null,null,null,null,null,null,15,null,null,null,null,null,null,null,null,100,null,2.6,null,2.6]
["FRIT 3419",null,0,null,null,59.2,null,null,null,6.4,null,null,null,null,null,null,14.5,null,19.899999999999999,null,null,null,null,null,null,null,null,100,null,2.6,null,2.6]
["FRIT 3467",null,0,null,7.9969999999999999,17.207000000000001,null,0.59799999999999998,1.6990000000000001,2.399,null,null,null,null,null,9.08,4.4950000000000001,null,56.524999999999999,null,null,null,null,null,null,null,null,100,null,2.6,null,2.6]
["FRIT 3481",null,0,null,9.9,22.77,null,null,1.19,3.09,null,null,null,null,null,7,6.2,null,49.86,null,null,null,null,null,null,null,null,100.01,null,2.6,null,2.6]
["FRIT 349",null,0,null,10.4,17.120999999999999,null,null,2.71,1.7829999999999999,null,null,null,null,null,6.194,8.0079999999999991,null,53.783999999999999,null,null,null,null,null,null,null,null,100,null,2.6,null,2.6]
["FRIT 3602",null,0,null,null,65.27,null,null,null,null,null,null,null,null,null,2.5,null,null,32.229999999999997,null,null,null,null,null,null,null,null,100,null,2.6,null,2.6]
["FRIT 439",null,3.08,null,30.26,null,null,4.95,null,7.97,null,null,null,null,null,1.62,41.32,null,13.89,null,null,null,null,null,null,null,null,100.01,1.4,2.6,null,2.6]
["FRIT 54",null,0,null,20,null,null,null,null,10.4,null,null,null,null,null,null,23.3,null,46.3,null,null,null,null,null,null,null,null,100,null,2.6,null,2.6]
["FRIT 67",null,0,null,12.46,null,null,null,3.64,3.79,null,null,null,null,null,12.15,26,null,42,null,null,null,null,null,null,null,null,100.03999999999999,null,2.6,null,2.6]
["FRIT 83",null,0,null,null,46.96,null,null,null,5.07,null,null,null,null,null,null,5.29,null,42.68,null,null,null,null,null,null,null,null,100,null,2.6,null,2.6]
["FRIT 938",null,0,4.97,9.27,null,null,null,3.05,3.82,null,2.64,null,null,null,6.61,13.98,null,55.68,null,null,null,null,null,null,null,null,100.02000000000001,null,2.6,null,2.6]
["FRIT B-40-C",null,3,null,24,null,null,null,null,null,null,null,null,null,null,33,40,null,null,null,null,null,null,null,null,null,null,97,null,2.6,null,2.6,"Digital Fire"]
["FRIT B-300",null,0,null,null,65,null,null,null,null,null,null,null,null,null,3,null,null,32,null,null,null,null,null,null,null,null,100,null,2.6,null,2.6]
["FRIT CC-250",null,0,null,13.51,null,null,null,5.0999999999999996,6.22,null,null,null,null,null,10.5,15.95,null,53.3,null,null,null,null,null,null,null,null,104.58,null,2.6,null,2.6]
["FRIT CC-257",null,0,33.799999999999997,5.5,null,null,0.31,0.79,1,0.56999999999999995,null,null,2.2000000000000002,null,9.26,null,null,46.52,null,null,null,null,null,null,null,null,99.95,null,2.6,null,2.6]
["FRIT F-13",null,0,null,18,null,null,null,0.15,8.5,null,null,null,null,null,4.5,18.5,null,50.35,null,null,null,null,null,null,null,null,100,null,2.6,null,2.6]
["FRIT F-19",null,0,null,14.2,null,null,null,null,7,null,null,null,null,null,9.6999999999999993,14.6,null,54.5,null,null,null,null,null,null,null,null,100,null,2.6,null,2.6]
["FRIT F-2",null,0,null,10.5,null,null,null,3.7,3,null,null,null,null,null,13.5,20.3,null,49,null,null,null,null,null,null,null,null,100,null,2.6,null,2.6]
["FRIT F-34",null,0,null,12,null,null,null,null,12.5,null,null,null,null,null,null,27.5,null,48,null,null,null,null,null,null,null,null,100,null,2.6,null,2.6]
["FRIT F-60",null,0,null,7.5,null,null,null,null,15,null,null,null,null,null,null,21.5,null,56,null,null,null,null,null,null,null,null,100,null,2.6,null,2.6]
["FRIT F-75",null,0,null,6.4,null,null,null,2.1,15.3,null,null,null,null,null,3.7,2.5,null,70,null,null,null,null,null,null,null,null,100,null,2.6,null,2.6]
["FRIT FZ-25",null,0,null,0.5,null,null,null,5.4,14.7,null,0.7,null,null,null,12.1,16.899999999999999,null,49.7,null,null,null,null,null,null,null,null,100,null,2.6,null,2.6]
["FRIT F-367",null,0,null,null,null,null,null,null,7.8,null,null,null,null,null,null,38.4,null,53.8,null,null,null,null,null,null,null,null,{"$f":"SUM(D105:Z105)+B105","v":100},null,2.6,null,2.6,"Digital Fire"]
["FRIT GF-111",null,0,null,20.04,null,null,null,null,10.28,null,null,null,null,null,null,23.3,null,46.37,null,null,null,null,null,null,null,null,99.990000000000009,null,2.6,null,2.6]
["FRIT GF-113",null,0,null,14.09,null,null,null,0.69,6.54,null,null,null,null,null,10.02,14.44,null,54.23,null,null,null,null,null,null,null,null,100.00999999999999,null,2.6,null,2.6]
["FRIT GF-115",null,0,null,11.43,null,null,null,null,5.95,null,null,null,null,null,11.92,23.15,null,47.55,null,null,null,null,null,null,null,null,100,null,2.6,null,2.6]
["FRIT GF-134",null,0,null,6.26,null,null,null,2.17,15.27,null,null,null,null,null,3.53,2.68,null,70.08,null,null,null,null,null,null,null,null,99.99,null,2.6,null,2.6]
["FRIT P-25",null,0,null,0.5,null,null,null,5.4,14.7,null,0.7,null,null,null,12.1,16.899999999999999,null,49.7,null,null,null,null,null,null,null,null,100,null,2.6,null,2.6]
["FRIT P-2950 (Lead Bisilicate)",null,0,null,null,64.930000000000007,null,null,null,null,null,null,null,null,null,2.5499999999999998,null,null,32.520000000000003,null,null,null,null,null,null,null,null,100,null,{"$f":"IF(AF111=\"\",7,AF111)","v":4.62},null,4.62]
["FRIT P-311",null,0,null,14.1,null,null,null,0.7,6.5,null,null,null,null,null,10,14.4,null,54.3,null,null,null,null,null,null,null,null,100,null,2.6,null,2.6]
["FRIT P-54",null,0,null,20,null,null,null,null,10.4,null,null,null,null,null,null,23.3,null,46.3,null,null,null,null,null,null,null,null,100,null,2.6,null,2.6]
["G-200 Feldspar",0.16,0.96800000000000008,null,0.81,null,null,0.05,10.8,3,null,null,null,null,null,18.5,null,null,66.3,0.08,null,null,null,null,null,null,null,99.699999999999989,0.44,2.56,null,2.56,"Imerys - http://www.google.com/search?q=G-200+feldspar+imery&ie=utf-8&oe=utf-8&aq=t&rls=org.mozilla:en-US:official&client=firefox-a"]
["G-200HP Feldspar",0.16,0.96800000000000008,null,0.75,null,null,null,13.2,1.52,null,null,null,null,null,18.2,null,null,65.900000000000006,0.09,null,null,null,null,null,null,null,{"$f":"SUM(D115:Z115)+B115","v":99.820000000000007},0.44,2.56,null,2.56,"Imery's - http://www.matweb.com/search/datasheet.aspx?matguid=db09979323584561be206c39b3f8c6cf&ckck=1"]
["Gerstley Borate",26,3.3000000000000003,null,24,null,null,4,0.5,4,null,null,null,null,null,2,25,null,14,0.5,null,null,null,null,null,null,null,100,1.5,2.42,null,2.42]
["Gillespie Borate",30.9,0,null,23,null,null,3.9,null,3.77,0.45,null,null,null,null,1.7,24.5,null,11.8,null,null,null,null,null,null,null,null,100.02000000000001,null,2.42,null,2.42]
["GK 129 Bentonite",5.7,0,null,1.95,null,null,3.24,0.97,2.61,null,null,null,0.16,null,15.4,null,null,68.069999999999993,1.89,null,null,null,null,null,null,null,99.99,null,1.8,null,1.8]
["Glacier 200 Talc",2.5,0,null,2,null,null,30,null,null,null,null,null,null,null,0.5,null,null,60,1,null,null,null,null,null,null,null,96,null,2.7,null,2.7]
["Glass Cullet",null,0,null,10.119999999999999,null,null,3.28,0.09,13.68,null,null,null,null,null,1.1399999999999999,null,null,71.47,0.23,null,null,null,null,null,null,null,100.01,null,2.5499999999999998,null,2.5499999999999998]
["Gleason Ball Clay",11.62,0,null,0.09,null,null,0.04,0.32,7.0000000000000007E-2,null,null,null,1.48,null,26.28,null,0.11,58.8,1.41,null,null,null,0.01,null,null,null,100.23,null,2.6,null,2.6]
["Goldart",10,0.52800000000000002,null,0.2,null,null,0.4,1.9,0.2,null,null,null,1.8,null,28.8,null,null,55.2,1.4,null,null,null,null,null,null,null,99.9,0.24,2.6,null,2.6]
["Grolleg Kaolin",12.01,0,null,0.1,null,null,0.3,1.9,0.1,null,null,null,0.03,null,37,null,null,48,0.7,null,null,null,null,null,null,null,100.14000000000001,null,2.6,null,2.6]
["Gunheath Kaolin",11.94,0,null,0.19,null,null,0.11,1.5,null,null,null,null,0.09,null,38.729999999999997,null,null,46.83,0.61,null,null,null,null,null,null,null,99.999999999999986,null,2.6,null,2.6]
["Hectalite",9.5,0,null,9.2899999999999991,null,null,18.739999999999998,0.3,2.58,null,null,null,null,null,1.46,null,null,56.99,1.1399999999999999,null,null,null,null,null,null,null,100,null,3.89,null,3.89]
["Helmer Kaolin",13.9,0,null,0.48,null,null,0.26,0.53,0.08,null,null,null,1.1299999999999999,null,36,null,null,46,1.3,null,null,null,null,null,null,null,99.679999999999993,null,2.6,null,2.6]
["Ilmenite",null,0,null,null,null,null,null,null,null,null,null,null,0.52639999999999998,null,null,null,null,null,0.52629999999999999,null,null,null,null,null,null,null,1.0527,null,4.75,null,4.75]
["Iron Oxide Black",null,7.5900000000000007,null,null,null,null,null,null,null,null,null,null,null,null,null,null,null,null,103.58,null,null,null,null,null,null,null,103.58,3.45,5.75,null,5.75]
["Iron Oxide Red",2,3.3000000000000003,null,null,null,null,null,null,null,null,null,null,null,null,null,null,null,null,98,null,null,null,null,null,null,null,100,1.5,5.242,null,5.242]
["Jackson Ball Clay",11.8,0,null,0.4,null,null,0.3,0.3,0.1,null,null,null,1.7,null,29.5,null,null,54.9,0.99999990000000005,null,null,null,null,null,null,null,99.999999899999992,null,2.6,null,2.6]
["Jasper Slip",11.3,0,null,7.1,null,null,2.9,2.7,0.4,null,null,null,0.8,null,14.1,null,null,55.1,5.6,null,null,null,null,null,null,null,99.999999999999986,null,2.6,null,2.6]
["Jordan Fireclay",6.78,0,null,0.2,null,null,0.5,2,0.19700000000000001,null,null,null,1.2,null,20.2,null,null,67.23,1.71,null,null,null,null,null,null,null,100.017,null,2.6,null,2.6]
["K&T Special",14.8,0,null,0.3,null,null,0.5,0.9,0.2,null,null,null,1.5,null,27.4,null,null,53.3,1.1000000000000001,null,null,null,null,null,null,null,99.999999999999986,null,2.6,null,2.6]
["K-200 Feldspar",0.31,0,null,0.18,null,null,null,10.14,3.36,null,null,null,null,null,17.86,null,null,68.069999999999993,0.08,null,null,null,null,null,null,null,99.999999999999986,null,2.66,null,2.66]
["Kaolin",12.5,0.77,null,null,null,null,null,null,null,null,null,null,null,null,40.17,null,null,47.33,null,null,null,null,null,null,null,null,100,{"$f":"AC57","v":0.35},2.6,null,2.6]
["Kaopaque 20 Kaolin",12,0,null,0.22,null,null,0.03,8.1000000000000003E-2,0.03,null,null,null,0.68,null,40.29,null,null,46.34,0.33,null,null,null,null,null,null,null,100.00099999999999,null,2.6,null,2.6]
["Kingman Feldspar",0.08,{"$f":"IF(AC137<>\"\",AC137*2.2,0)","v":0},null,0.1,null,null,null,12,2.8,null,null,null,null,null,18.7,null,null,66.17,0.11,null,null,null,null,null,null,null,{"$f":"SUM(D137:Z137)+B137","v":99.96},null,2.66,null,2.66]
["Kentucky OM #4 Ball Clay",13.2,0.55000000000000004,null,0.3,null,null,0.5,0.9,0.2,null,null,null,1.5,null,27,null,null,55.4,1,null,null,null,null,null,null,null,100,0.25,{"$f":"IF(AF138=\"\",AD$2,AF138)","v":2.6},null,2.6]
["KTS-2 Ball Clay",9.9,0,null,0.3,null,null,0.4,1.3,0.2,null,null,null,1.4,null,24.3,null,null,61.2,1,null,null,null,null,null,null,null,100.00000000000001,null,2.6,null,2.6]
["KY Special",13.3,0,null,0.5,null,null,0.5,1.1000000000000001,null,null,null,null,1.3,null,27.5,null,null,54.56,1.2,null,null,null,null,null,null,null,99.960000000000008,null,2.6,null,2.6]
["Kyanite",null,0.66,null,null,null,null,null,null,null,null,null,null,null,null,62.9,null,null,37.08,null,null,null,null,null,null,null,null,99.97999999999999,0.3,3.67,null,3.67]
["Laguna Borate",19,0,null,18.899999999999999,null,null,2.2999999999999998,1.38,4,null,null,null,null,null,8.1,27.5,null,16.7,7.0000000000000007E-2,null,null,null,null,null,null,null,97.949999999999989,null,2.42,null,2.42]
["Lead Bisilicate",null,0,null,null,64.930000000000007,null,null,null,null,null,null,null,null,null,2.5499999999999998,null,null,32.520000000000003,null,null,null,null,null,null,null,null,100,null,4.62,null,4.62]
["Lead Carbonate",13.5,0,null,null,86.5,null,null,null,null,null,null,null,null,null,null,null,null,null,null,null,null,null,null,null,null,null,100,null,6.6,null,6.6]
["Lepidolite",27.5,0,null,null,null,3.1,null,6.9,0.76,null,null,null,null,null,19.2,null,null,42.4,0.06,null,null,null,null,null,null,null,99.92,null,2.84,null,2.84]
["Litharge",null,0,null,null,100,null,null,null,null,null,null,null,null,null,null,null,null,null,null,null,null,null,null,null,null,null,100,null,6.6,null,6.6]
["Lithium Carbonate",59.3,48.400000000000006,null,null,null,40.700000000000003,null,null,null,null,null,null,null,null,null,null,null,null,null,null,null,null,null,null,null,null,100,22,2.11,null,2.11]
["Lithospar",null,0,null,null,null,2,null,2.9,4.04,null,null,null,null,null,21.69,null,null,69.400000000000006,null,null,null,null,null,null,null,null,100.03,null,3.15,null,3.15]
["M&D Ball Clay",10.1,0,null,0.5,null,null,0.5,0.5,null,null,null,null,1.3,null,27.3,null,null,57.46,2.2999999999999998,null,null,null,null,null,null,null,99.96,null,2.6,null,2.6]
["Magnesium Carbonate",56.5,13.200000000000001,null,0.5,null,null,42.6,null,null,0.25,null,null,null,null,0.15,null,null,null,0.03,null,null,null,null,null,null,null,100.03,6,2,null,2]
["Manganese Carbonate",38.380000000000003,14.3,null,null,null,null,null,null,null,null,null,null,null,null,null,null,null,null,null,null,null,null,61.6,null,null,null,99.98,6.5,3.12,null,3.12]
["Manganese Dioxide. MnO2",29.1,5.5,null,null,null,null,null,null,null,null,null,null,null,null,null,null,null,null,null,null,null,null,70.900000000000006,null,null,null,100,2.5,5.0259999999999998,null,5.0259999999999998]
["Manganese Oxide. MnO",18.5,5.5,null,null,null,null,null,null,null,null,null,null,null,null,null,null,null,null,null,null,null,null,81.5,null,null,null,100,2.5,5.43,null,5.43]
["Minspar 200",0.3,0.68200000000000005,null,1.5,null,null,null,4.0999999999999996,6.5,null,null,null,null,null,18.5,null,null,68.599999999999994,0.06,null,null,null,null,null,null,null,99.559999999999988,0.31,2.66,null,2.66]
["Mullite",null,0.9900000000000001,null,null,null,null,null,null,null,null,null,null,null,null,71.8,null,null,28.2,null,null,null,null,null,null,null,null,100,0.45,3.2,null,3.2]
["Murrays Borate",5,0,null,24.9,null,null,null,null,5.7,null,null,null,null,null,0.49,36.1,null,27.8,null,null,null,null,null,null,null,null,99.99,null,2.42,null,2.42]
["Nepheline Syenite",0.7,0.68200000000000005,null,0.7,null,null,0.1,4.5999999999999996,9.8000000000000007,null,null,null,null,null,23.3,null,null,60.7,7.0000000000000007E-2,null,null,null,null,null,null,null,99.97,0.31,2.66,null,2.66]
["Nickel Oxide, green",0,92.4,null,null,null,null,null,null,null,null,null,null,null,null,null,null,null,null,null,null,null,null,null,100,null,null,100,42,6.62,null,6.62]
["NP Blend Ball Clay",11.4,0,null,0.3,null,null,0.4,0.95,0.25,null,null,null,1.6,null,29.45,null,null,54.5,1.1499999999999999,null,null,null,null,null,null,null,100.00000000000001,null,2.6,null,2.6]
["Nytal Talc",5.4,0,null,8.4,null,null,30,null,0.34,null,null,null,null,null,0.31,null,null,55.2,0.16,null,null,null,0.17,null,null,null,99.98,null,2.7,null,2.7]
["Ocamulgee Red Clay",13.7,0.55000000000000004,null,0.37,null,null,0.79,1.29,0.36,null,null,null,1.2,null,21.8,null,null,53.9,6.4,null,null,null,0.23,null,null,null,100.04000000000002,0.25,2.6,null,2.6]
["OM #4 Ball Clay",12.6,0.55000000000000004,null,0.3,null,null,0.4,1,0.3,null,null,null,1.2,null,27.9,null,null,55.2,1.1000000000000001,null,null,null,null,null,null,null,99.999999999999986,{"$f":"AC138","v":0.25},2.6,null,2.6]
["Oxford Feldspar",0.186,0,null,0.38,null,null,null,8.06,3.27,null,null,null,null,null,17.32,null,null,70.69,0.1,null,null,null,null,null,null,null,100.006,null,2.66,null,2.66]
["PBX Fireclay",0.88,0,null,0.36,null,null,0.35,null,null,null,null,null,1.5,null,38.5,null,null,56.6,1.75,null,null,null,null,null,null,null,99.94,null,2.6,null,2.6]
["Pearl Ash",43,0,null,null,null,null,null,57,null,null,null,null,null,null,null,null,null,null,null,null,null,null,null,null,null,null,100,null,2.04,null,2.04]
["Pearl Ash Calcined",31.8,0,null,null,null,null,null,68.2,null,null,null,null,null,null,null,null,null,null,null,null,null,null,null,null,null,null,100,null,2.4300000000000002,null,2.4300000000000002]
["Petalite",0.55000000000000004,5.5,null,null,null,4.32,null,0.26,0.25,null,null,null,null,null,17.5,null,null,77.13,null,null,null,null,null,null,null,null,100.00999999999999,2.5,2.4300000000000002,null,2.4300000000000002]
["Pioneer Kaolin",13.96,0,null,0.2,null,null,0.1,null,0.1,null,null,null,1.4,null,38.299999999999997,null,null,45.4,0.4,null,null,null,null,null,null,null,99.860000000000014,null,2.6,null,2.6]
["Plastic Vitrox",2.8,0.66,null,1,null,null,0.5,5,0.9,null,null,null,0.1,null,12.7,null,null,76.5,0.5,null,null,null,null,null,null,null,100,0.3,2.6,null,2.6]
["Portland Cement",3.2,0,null,62.28,null,null,2.2200000000000002,null,null,null,null,null,null,null,7.55,null,null,22.65,2.1,null,null,null,null,null,null,null,99.999999999999986,null,{"$f":"IF(AF170=\"\",3.5,AF170)","v":1.44},null,1.44]
["Potash Feldspar",0.04,0,null,null,null,null,null,16.899999999999999,null,null,null,null,null,null,18.311730000000001,null,null,64.737350000000006,null,null,null,null,null,null,null,null,99.989080000000016,null,2.66,null,2.66]
["Pumice",3.8,0,null,0.7,null,null,null,7.8,1.8,null,null,null,0.5,null,11.5,null,null,72.7,1.2,null,null,null,null,null,null,null,100,null,0.95,null,0.95]
["PC Clay",2.8,0,null,1,null,null,0.5,5,0.9,null,null,null,0.1,null,12.7,null,null,76.5,0.5,null,null,null,null,null,null,null,100,null,2.6,null,2.6]
["Pyrax Pyrophyllite",3.1,0,null,0.1,null,null,0.1,1.8,0.3,null,null,null,0.1,null,16.079999999999998,null,null,78.202780000000004,0.20106589999999999,null,null,null,null,null,null,null,99.983845900000006,null,2.75,null,2.75]
["Pyrophyllite",4,0.70400000000000007,null,null,null,null,null,null,null,null,null,null,null,null,28.3,null,null,67.7,null,null,null,null,null,null,null,null,100,0.32,2.75,null,2.75]
["Quartz",null,0.50600000000000012,null,null,null,null,null,null,null,null,null,null,null,null,null,null,null,100,null,null,null,null,null,null,null,null,100,{"$f":"AC184","v":0.23},2.6,null,2.6]
["Ravenscrag Slip",4.8,0,null,4.97,null,null,1.9,3.37,0.5,null,null,null,0.43,null,14.15,null,null,69.02,0.86,null,null,null,null,null,null,null,100,null,2.6,null,2.6]
["Red Lead",2.1,0,null,null,97.9,null,null,null,null,null,null,null,null,null,null,null,null,null,null,null,null,null,null,null,null,null,100,null,8.3000000000000007,null,8.3000000000000007]
["Redart",4.8,0.66,null,0.26,null,null,1.6,4.1500000000000004,0.38,null,null,null,1.0900000000000001,null,15.5,null,0.22,65,7,null,null,null,null,null,null,null,100,0.3,2.6,null,2.6]
["Rutile",0.1,9.3500000000000014,null,null,null,null,null,null,null,null,null,null,92,0.97,0.3,null,null,null,6.5,null,null,null,null,null,null,null,99.86999999999999,4.25,4.2300000000000004,null,4.2300000000000004]
["Saffer XX Ball Clay",9.6999999999999993,0,null,0.5,null,null,0.3,0.9,0.3,null,null,null,1.7,null,29.17,null,null,56.73,0.69,null,null,null,null,null,null,null,99.99,null,2.6,null,2.6]
["Sheffield Slip",8,0,null,3.5,null,null,3.87,4.4400000000000004,1.32,null,null,null,1.06,null,21.15,null,null,55.93,8.73,null,null,null,null,null,null,null,108.00000000000001,null,2.6,null,2.6]
["SIL-O-SPAR",7.0000000000000007E-2,0,null,1.05,null,null,null,2.87,4.88,null,null,null,null,null,13.5,null,null,77.569999999999993,0.06,null,null,null,null,null,null,null,99.999999999999986,null,2.65,null,2.65]
["Silica",null,0.50600000000000012,null,null,null,null,null,null,null,null,null,null,null,null,null,null,null,100,null,null,null,null,null,null,null,null,100,0.23,2.65,null,2.65]
["Silica, SIL-CO-SIL 52",0.01,0.50600000000000012,null,8.0000000000000002E-3,null,null,8.0000000000000002E-3,0.01,8.0000000000000002E-3,null,null,null,0.02,null,0.2,null,null,99.64,2.5999999999999999E-2,null,null,null,null,null,null,null,{"$f":"SUM(D185:Z185)+B185","v":99.93},0.23,2.65,null,2.65,"SIL-CO-SIL 52 http://www.u-s-silica.com/PDS/Columbia/ColSCS522009.pdf"]
["Sledge Ball Clay",8.77,0,null,0.4,null,null,0.4,0.4,null,null,null,null,1.8,null,24.3,null,null,63,0.9,null,null,null,null,null,null,null,99.97,null,2.6,null,2.6]
["Snobrite Kaolin",13.9,0,null,0.26,null,null,null,null,null,null,null,null,0.5,null,39.700000000000003,null,null,44.8,0.75,null,null,null,null,null,null,null,99.91,null,2.6,null,2.6]
["Soda Ash",78.3,2.09,null,null,null,null,null,null,21.7,null,null,null,null,null,null,null,null,null,null,null,null,null,null,null,null,null,100,0.95,2.25,null,2.25]
["Soda Feldspar",null,0,null,null,null,null,null,null,11.8,null,null,null,null,null,19.440000000000001,null,null,68.739999999999995,null,null,null,null,null,null,null,null,99.97999999999999,null,2.66,null,2.66]
["Spinks Blend Ball",10.65,0,null,0.23,null,null,0.24,0.67,0.19,null,null,null,1.5,null,26.75,null,0.11,58.59,1.05,null,null,null,1.9894800000000001E-2,null,null,null,99.999894800000007,null,{"$f":"IF(AF190=\"\",AD$2,AF190)","v":2.6},null,2.6]
["Spodumene",1.5,3.8500000000000005,null,null,null,8.01,null,null,null,null,null,null,null,null,27.41,null,null,64.59,null,null,null,null,null,null,null,null,101.51,1.75,{"$f":"IF(AF191=\"\",AD$2,AF191)","v":3.15},null,3.15]
["Spruce Pine #4 Spar",null,0,null,1.55,null,null,null,5,6.2,null,null,null,null,null,19.05,null,null,68.14,0.06,null,null,null,null,null,null,null,100,null,2.56,null,2.56]
["Strontium Carbonate",29.8,6.0500000000000007,null,null,null,null,null,null,null,70.2,null,null,null,null,null,null,null,null,null,null,null,null,null,null,null,null,100,2.75,3.74,null,3.74]
["Superpax",null,0,null,null,null,null,null,null,null,null,null,null,null,66.3,null,null,null,33.700000000000003,null,null,null,null,null,null,null,null,100,null,4.5599999999999996,null,4.5599999999999996]
["Talc",8,2.09,null,3.5,null,null,29.5,0.25,null,null,null,null,null,null,0.4,null,null,54.5,0.4,null,null,null,null,null,null,null,{"$f":"SUM(D195:Z195)+B195","v":96.550000000000011},0.95,2.7,null,2.7]
["Talc, C-98",10.63,2.09,null,3.5,null,null,29.5,0.27,null,null,null,null,0.9,null,0.45,null,null,54.3,0.45,null,null,null,null,null,null,null,100,0.95,2.7,null,2.7,"Amtal CB-98"]
["Tektamer 38 Biocide",null,0,null,null,null,null,null,null,null,null,null,null,null,null,null,null,null,null,null,null,null,null,null,null,null,null,0,null,2.5]
["Tennessee #1 Ball",10.199999999999999,0,null,0.3,null,null,0.3,1.2,0.2,null,null,null,1.5,null,28.1,null,null,57.4,0.8,null,null,null,null,null,null,null,100,null,2.6,null,2.6]
["Tennessee #5 Ball",12.6,0.48400000000000004,null,0.3,null,null,0.4,1,0.3,null,null,null,1.2,null,27.9,null,null,55.2,1.1000000000000001,null,null,null,null,null,null,null,99.999999999999986,0.22,2.6,null,2.6]
["Tennessee #10 Ball",11.9,0.48400000000000004,null,0.4,null,null,0.3,0.6,0.6,null,null,null,1.5,null,30.9,null,null,52.8,1.01,null,null,null,null,null,null,null,100.01,0.22,2.6,null,2.6]
["Tile #6 Kaolin",13.9,{"$f":"IF(AC201<>\"\",AC201*2.2,0)","v":0.52800000000000002},null,0.42,null,null,0.56999999999999995,null,0.04,null,null,null,1.4,null,37.4,null,null,45.9,0.34,null,null,null,null,null,null,null,99.97,0.24,2.6,null,2.6]
["Tin Oxide",null,48.400000000000006,null,null,null,null,null,null,null,null,null,100,null,null,null,null,null,null,null,null,null,null,null,null,null,null,100,22,{"$f":"IF(AF202=\"\",AD$2,AF202)","v":6.9},null,6.9]
["Titanium Dioxide",null,13.200000000000001,null,null,null,null,null,null,null,null,null,null,100,null,null,null,null,null,null,null,null,null,null,null,null,null,100,6,3.78,null,3.78]
["Turkish Colemanite",24.5,0,null,26.48,null,null,1.76,null,0.1,0.66,null,null,null,null,7.0000000000000007E-2,41.34,null,5.03,0.06,null,null,null,null,null,null,null,100.00000000000001,null,2.42,null,2.42]
["Turkish Ulexite",33.9,0,null,19.7,null,null,2,null,5.8,null,null,null,null,null,0.2,33.21,null,5.2,null,null,null,null,null,null,null,null,{"$f":"SUM(D205:Z205)+B205","v":100.00999999999999},null,1.95,null,1.95]
["Ultrox",null,0,null,null,null,null,null,null,null,null,null,null,null,65,null,null,null,35,null,null,null,null,null,null,null,null,100,null,4.5599999999999996,null,4.5599999999999996]
["Veegum T",null,0,null,null,null,null,null,null,null,null,null,null,null,null,null,null,null,null,null,null,null,null,null,null,null,null,0,null,1,null,1]
["Velvacast Kaolin",13.7,0,null,0.25600000000000001,null,null,0.18,null,null,null,null,null,1.1000000000000001,null,38.9,null,null,45.49,0.37,null,null,null,null,null,null,null,99.996000000000009,null,2.6,null,2.6]
["vol353cer Hectorite",20.6,0,null,6.74,null,1.5,19,0.73,2.35,null,null,null,0.27,null,3.8,null,null,43.4,1.55,null,null,null,null,null,null,null,99.94,null,2.5]
["Volcanic Ash",1,5.5,null,6,null,null,3,1,4,null,null,null,0.5,null,15,null,null,67,2,null,null,null,null,null,null,null,99.5,2.5,2.5]
["Whiting, #10",43.9,0.55000000000000004,null,53.2,null,null,0.91,null,null,null,null,null,null,null,0.6,null,null,1.1000000000000001,0.15,null,null,null,null,null,null,null,99.86,0.25,2.71,null,2.71,"Imery's #10, lot 1008161A2"]
["Whiting",43.9,0.52800000000000002,null,54.14,null,null,0.96,null,null,null,null,null,null,null,null,null,null,1,null,null,null,null,null,null,null,null,100,{"$f":"AC36","v":0.24},2.71,null,2.71,"Huber Q-325  http://www.hubermaterials.com/606.htm"]
["Wollastonite",2.04,2.3100000000000005,null,42.1,null,null,1.49,null,0.27,null,null,null,null,null,1.82,null,null,51.91,0.37,null,null,null,null,null,null,null,100.00000000000001,1.05,2.93,null,2.93]
["Wollastonite Vansil",3.1,0,null,41.42,null,null,1.48,0.05,0.28999999999999998,null,null,null,0.05,null,1.78,null,null,51.05,0.79,null,null,null,null,null,null,null,100.00999999999999,null,2.93,null,2.93]
["wood, pine",94.445170000000005,0,{"$f":"D15*(100-$B215)/(100-$B15)","v":0},3.2470987483999405,0,0,0.64862970132271325,0.86589299957331756,6.0833723510169198E-2,0,0,0,0,0,0,0,0,0.15800967145498493,5.5303385009244739E-3,0,0,0,0.20067228274783086,null,null,null,99.631837465509889,0,1.5,null,1.5]
["Yellow Ochre",null,0,null,0.23,null,null,0.05,null,null,null,null,null,null,null,20,null,null,57.8,22,null,null,null,null,null,null,null,100.08,null,4.25,null,4.25]
["Zinc Oxide",null,12.100000000000001,null,null,null,null,null,null,null,null,100,null,null,null,null,null,null,null,null,null,null,null,null,null,null,null,100,5.5,5.6059999999999999,null,5.6059999999999999]
["Zircopax",null,5.5,null,null,null,null,null,null,null,null,null,null,null,67.209999999999994,null,null,null,32.799999999999997,null,null,null,null,null,null,null,null,100.00999999999999,2.5,4.5599999999999996,null,4.5599999999999996]
["Zirconium Oxide",null,12.100000000000001,null,null,null,null,null,null,null,null,null,null,null,100,null,null,null,null,null,null,null,null,null,null,null,null,100,5.5,5.68,null,5.68]
[null,null,null,null,null,null,null,null,null,null,null,null,null,null,null,null,null,null,null,null,null,null,null,null,null,null,null,0,null,2.5]
[null,null,null,null,null,null,null,null,null,null,null,null,null,null,null,null,null,null,null,null,null,null,null,null,null,null,null,0,null,2.5]
[]
[]
["Grog, fine",null,{"$f":"IF(AC224<>\"\",AC224*2.2,\"\")","v":0.88000000000000012},null,null,null,null,null,null,null,null,null,null,null,null,null,null,null,null,null,null,null,null,null,null,null,null,null,0.4]
["Grog, Med",null,0.88000000000000012,null,null,null,null,null,null,null,null,null,null,null,null,null,null,null,null,null,null,null,null,null,null,null,null,null,0.4]
["Grog, Coarse",null,0.88000000000000012,null,null,null,null,null,null,null,null,null,null,null,null,null,null,null,null,null,null,null,null,null,null,null,null,null,0.4]

{"sheet":"About","index":6,"n_rows":0,"n_cols":0,"rows_kept":0,"cut":false,"hidden":false,"merged":[]}

{"sheet":"Constants","index":7,"n_rows":54,"n_cols":9,"rows_kept":54,"cut":false,"hidden":true,"merged":[]}
[]
[]
[]
[null,"Coefficients","Table 1","Table 2","Table 3",null,null,"Table 3 Overrides"]
[null,"& Constants","x10^4/F",null,"Dig Fire",null,null,"x10^4/F","x10^4/C"]
[null,null,"CoE","CoE","CoE","MW",null,100]
[null,"Al2O3",1.4E-2,1.4,{"$f":"H7*H$6","v":3.0000000000000004},{"$f":"C32*2+3*C46","v":101.96000000000001},null,{"$f":"I7*5/9","v":3.0000000000000002E-2},{"$f":"5.4/100","v":5.4000000000000006E-2}]
[null,"B2O3",-6.5000000000000002E-2,-6.53,{"$f":"H8*H$6","v":3.1},{"$f":"2*C33+3*15.9994","v":69.618200000000002},null,3.1E-2]
[null,"BaO",0.14000000000000001,14,{"$f":"H9*H$6","v":7.166666666666667},{"$f":"C34+C46","v":153.33000000000001},null,{"$f":"I9*5/9","v":7.166666666666667E-2},{"$f":"0.129","v":0.129}]
[null,"CaO",0.16300000000000001,16.3,7.2888888888888896,{"$f":"C35+16","v":56.08},null,{"$f":"I10*5/9","v":7.2888888888888892E-2},0.13120000000000001]
[null,"CoO",0.05,8.8000000000000007,5.5555555555555562,{"$f":"58.93+C46","v":74.930000000000007},null,{"$f":"C11/0.9","v":5.5555555555555559E-2}]
[null,"Cr2O3",5.7000000000000002E-2,10.199999999999999,6.3333333333333339,{"$f":"3*C46+2*C37","v":152},null,{"$f":"C12/0.9","v":6.3333333333333339E-2}]
[null,"CuO",0.03,4.4000000000000004,3.5000000000000004,{"$f":"C46+63.54","v":79.539999999999992},null,3.5000000000000003E-2]
[null,"Fe2O3",0.05,10.4,5.7833333333333323,{"$f":"3*16+2*C39","v":159.68},null,{"$f":"I14*5/9","v":5.7833333333333327E-2},0.1041]
[null,"FeO",5.5E-2,{"$f":"D14/C14*C15","v":11.44},6.666666666666667,{"$f":"C39+C46","v":71.84},null,{"$f":"I15*5/9","v":6.6666666666666666E-2},0.12]
[null,"K2O",0.39,39,33.1,{"$f":"C46+2*C40","v":94.2},null,0.33100000000000002]
[null,"Li2O",7.4999999999999997E-2,7.45,6.8000000000000007,{"$f":"C46+C41*2","v":29.881999999999998},null,6.8000000000000005E-2]
[null,"MgO",4.4999999999999998E-2,4.5,6.0000000000000009,{"$f":"C42+C46","v":40.31},null,{"$f":"I18*5/9","v":6.0000000000000005E-2},0.108]
[null,"MnO",5.7000000000000002E-2,5.7,5,{"$f":"C46+C43","v":70.94},null,{"$f":"I19*5/9","v":4.9999999999999996E-2},0.09]
[null,"Na2O",0.41599999999999998,41.6,38.700000000000003,{"$f":"2*C44+C46","v":61.98},null,0.38700000000000001]
[null,"NiO",0.05,{"$f":"5","v":5},5,{"$f":"C46+C45","v":74.69},null,0.05]
[null,"P2O5",6.8000000000000005E-2,7.45,7.1400000000000006,{"$f":"C46*5+2*C47","v":141.94},null,{"$f":"C22*1.05","v":7.1400000000000005E-2}]
[null,"PbO",0.106,10.6,8.3000000000000007,{"$f":"C46+C48","v":223.2},null,8.3000000000000004E-2]
[null,"SiO2",5.0000000000000001E-3,0.5,0.30555555555555552,{"$f":"2*C46+C49","v":60.09},null,{"$f":"I24*5/9","v":3.0555555555555553E-3},5.4999999999999997E-3]
[null,"SnO2",3.6999999999999998E-2,3.65,3.65,{"$f":"C50+2*C46","v":150.70999999999998},null,3.6499999999999998E-2]
[null,"SrO",0.14099999999999999,13.5,7.4555555555555557,{"$f":"C51+C46","v":103.62},null,{"$f":"I26*5/9","v":7.4555555555555555E-2},0.13420000000000001]
[null,"TiO2",0.106,10.6,3.9666666666666668,{"$f":"C52+2*C46","v":79.87},null,{"$f":"I27*5/9","v":3.966666666666667E-2},7.1400000000000005E-2]
[null,"ZnO",7.0000000000000007E-2,7,9.4,{"$f":"C54+C46","v":81.39},null,9.4E-2]
[null,"ZrO2",2.3E-2,2.2999999999999998,2,{"$f":"C53+2*C46","v":123.22},null,0.02]
[]
["At Wts"]
[null,"Al",26.98]
[null,"B",10.81]
[null,"Ba",137.33000000000001]
[null,"Ca",40.08]
[null,"Co",58.93]
[null,"Cr",52]
[null,"Cu",63.55]
[null,"Fe",55.84]
[null,"K",39.1]
[null,"Li",6.9409999999999998]
[null,"Mg",24.31]
[null,"Mn",54.94]
[null,"Na",22.99]
[null,"Ni",58.69]
[null,"O",16]
[null,"P",30.97]
[null,"Pb",207.2]
[null,"Si",28.09]
[null,"Sn",118.71]
[null,"Sr",87.62]
[null,"Ti",47.87]
[null,"Zr",91.22]
[null,"Zn",65.39]

{"sheet":"FAQ","index":8,"n_rows":0,"n_cols":0,"rows_kept":0,"cut":false,"hidden":false,"merged":[]}

{"sheet":"scratchSheet1","index":9,"n_rows":24,"n_cols":7,"rows_kept":24,"cut":false,"hidden":true,"merged":[]}
[{"$f":"scratchSheet1!#REF!","v":{"$error":"#REF!"}},"Weight",{"$f":"AND(ISNUMBER(D1), IF(NOT(ISNUMBER(D2)),FALSE,D2<>0))","v":true},{"$f":"scratchSheet1!$E$10:$E$10","v":0}]
[5,8,9,{"$f":"MDETERM(Matrix)","v":-0.77659580000000006}]
[]
[null,"Materials ","Wt (Grams)",null,"BaO","Al2O3","SiO2"]
[null,"Alumina Calcined",1,null,0,1,0]
[null,"Barium Carbonate",2,null,0.77659580000000006,0,0]
[null,"silica",3,null,0,0,1]
[null,null,null,null,"","",""]
[null,null,null,null,"","",""]
[null,null,null,null,0,1.2876711411521926,0]
[null,null,null,null,1,0,0]
[null,null,null,null,0,0,1]
[null,null,null,null,"","",""]
[null,null,null,null,"","",""]
[null,null,null,null,"","",""]
[null,null,null,null,"","",""]
[null,null,null,null,"","",""]
[null,null,null,null,"","",""]
[null,null,null,null,"","",""]
[null,null,null,null,"","",""]
[null,null,null,null,"","",""]
[null,null,null,null,"","",""]
[null,null,null,null,"","",""]
[null,null,null,null,"","",""]